program: Gaussian 09
title: 000009340
version: EM64L-G09RevD.01
frameworkgroup: C1[X(C17H19ClN2)]
method: RPBEPBE
basis: SDD
operation: Freq
keyword: #p
keyword: freq=noraman
keyword: PBEPBE/SDD
title: #p freq=noraman PBEPBE/SDD
converged: YES YES NO NO
title: Mulliken charges:
elementType: Cl N N C C C C C C C C C C C C C C C C C H H H H H H H H H H H H H H H H H H H
charge: -0.063635 -0.144758 -0.235740 -0.317564 -0.335224 -0.340532 -0.473153 -0.473139 0.471438 0.463773 -0.431610 -0.357225 -0.452072 -0.346104 -0.208433 -0.228440 -0.223659 -0.240244 -0.114437 -0.243652 0.197767 0.237645 0.173242 0.176178 0.234271 0.217283 0.218786 0.218085 0.218105 0.247799 0.233082 0.266956 0.227537 0.242743 0.252255 0.252958 0.225019 0.225873 0.228826
chargesum: 0.00000
title: Mulliken charges with hydrogens summed into heavy atoms:
elementType: Cl N N C C C C C C C C C C C C C C C C C
charge: -0.063635 -0.144758 0.012058 -0.119797 0.075663 0.069917 -0.037083 -0.036950 0.471438 0.463773 -0.198527 -0.090269 -0.224536 -0.103360 0.043822 0.024518 0.001360 -0.014370 -0.114437 -0.014827
polarizability: 2.31686173e+02 -1.86663004e+01 1.96249942e+02 -1.77746397e+00 7.64470782e+00 1.74011132e+02
1716.lowfreq: -11.4354 -7.8032 -1.2518 0.0022 0.0023 0.0024 12.3788 34.9736 50.0372
frequency: 8.2667 34.9644 49.9684 61.8172 68.9613 75.7356 136.7233 156.8543 212.4297 222.8237 226.0082 250.6694 293.4163 306.2260 324.3527 338.7344 394.3664 402.9869 411.4391 415.4508 463.4446 485.5446 491.5915 535.4331 589.3415 614.5232 618.5942 628.1197 669.6435 688.8906 701.2020 718.6873 759.2118 796.6589 804.2302 825.0561 833.9069 840.7618 851.9763 855.5498 888.0307 919.1261 928.7412 954.7028 974.6233 984.8287 990.6933 994.2222 997.4622 1000.7579 1014.6564 1017.9068 1026.0662 1070.0768 1076.8308 1091.9171 1111.0071 1122.0301 1132.2514 1149.3066 1171.4779 1174.7603 1181.1525 1183.8679 1187.4372 1201.3021 1240.7658 1272.0732 1276.5554 1287.2818 1302.5779 1320.9943 1332.7266 1334.9529 1339.8373 1357.9213 1371.4534 1380.7149 1388.7360 1394.9260 1438.6438 1440.3855 1442.3293 1446.4107 1461.0504 1468.3728 1471.6587 1479.7954 1587.4856 1594.0044 1597.0011 1610.2683 2821.5067 2825.3405 2841.4300 2991.0808 2993.7300 3050.7701 3057.5583 3059.9668 3062.1933 3113.9538 3124.9520 3125.9119 3138.0724 3140.8174 3150.5734 3164.1053 3166.3011 3169.4278 3417.6543
redmass: 3.5811 7.2946 4.0295 3.8524 4.5217 3.8410 6.4534 4.1637 5.5563 4.5316 2.8318 3.4383 3.2168 2.7490 4.2096 4.7118 2.2236 2.7692 3.3027 3.5152 2.8192 3.6012 3.9671 2.7750 1.7538 5.7197 5.9304 5.2402 4.8638 2.1118 1.9530 2.9331 2.3119 2.9425 2.7572 1.6564 1.4330 2.5312 1.4283 1.6782 2.0460 1.7584 1.8454 1.3773 1.3909 1.4295 4.6015 1.8621 2.0541 3.5135 1.6007 2.3306 2.1780 2.6799 1.7388 1.9854 1.6176 4.1102 2.1665 2.8805 1.0690 1.1535 1.3588 1.4288 1.7847 1.9825 1.3636 1.4574 1.3738 1.3582 1.3851 1.3065 1.2490 1.2609 1.3102 1.2954 2.1314 4.4949 3.2939 2.4227 1.0829 1.9701 1.1949 1.1016 1.0975 1.1057 2.4000 2.2782 7.3959 6.1740 6.3114 6.1543 1.0801 1.0716 1.0708 1.0604 1.0622 1.0868 1.0878 1.1032 1.1033 1.0872 1.0888 1.0870 1.0911 1.0894 1.0950 1.1011 1.0952 1.0962 1.0742
irintensity: 0.4067 0.0463 0.6478 0.4480 0.1887 0.5260 0.0137 0.2328 0.5198 0.4484 1.2613 0.0852 5.7090 11.6044 5.4642 0.7668 10.7072 0.4629 2.7223 2.8045 0.7027 9.3234 20.8664 12.0686 60.2313 1.4835 7.1791 5.5359 23.4688 182.2411 27.2933 18.4752 51.6821 11.9601 42.6779 0.2918 1.6171 3.0607 8.4302 22.7018 3.1687 3.8363 3.6359 1.8400 0.1432 6.6501 3.0463 27.8988 31.0590 24.6129 5.6272 10.0084 5.6048 35.8629 17.5287 17.8659 8.8306 33.2252 28.7169 2.7098 0.4946 4.1345 5.9313 5.1483 5.7545 1.6630 4.7634 21.5528 17.9907 8.0313 4.2936 1.7944 3.1746 0.4276 4.3602 3.6162 0.8249 1.4217 4.1059 7.8408 5.2737 11.2781 11.2756 11.8674 0.3787 3.2830 92.0771 11.6742 1.8900 0.5512 7.6170 6.5227 22.9063 37.0343 188.1361 44.3573 42.0678 42.8537 29.9878 16.3319 54.3590 7.7360 7.2088 2.0405 20.0560 3.0520 31.4431 22.0634 7.5410 1.1425 2.1677
temp: 298.150 k
press: 1.00000 atm
elementType: 17 7 7 6 6 6 6 6 6 6 6 6 6 6 6 6 6 6 6 6 1 1 1 1 1 1 1 1 1 1 1 1 1 1 1 1 1 1 1
symmnumber: 1
zpe: 841956.1 jmol-1
zpe.correction: 0.320684 hartree
zpe.thermalcorrener: 0.338310 hartree
zpe.thermalcorrenthalpy: 0.339254 hartree
zpe.thermalcorrgfe: 0.272403 hartree
zpe.sumelectzpe: -1227.290506 hartree
zpe.sumelectthermal: -1227.272880 hartree
zpe.sumelectthermalent: -1227.271936 hartree
zpe.sumelectthermalfe: -1227.338787 hartree
dipole: -2.2176 0.9834 1.9111
dipole: 3.0882
quadrupole: -139.8633 -125.5361 -115.0848
quadrupole: -5.8811 -2.7113 -2.6910
quadrupole: -13.0352 1.2920 11.7433 -5.8811 -2.7113 -2.6910
hfenergy: -1227.6111899 hartree
pointgroup: C01 [X(C17H19Cl1N2)]
dipole: -0.834524 -0.1486978 -0.8704441 debye
polarizability: 234.9843096|10.7079242|189.2473416|10.7788964|10.3864441|177.7155965 unknown
InChI: InChI=1S/C17H19ClN2/c18-16-8-6-15(7-9-16)17(14-4-2-1-3-5-14)20-12-10-19-11-13-20/h1-9,17,19H,10-13H2
charge 0 multiplicity 1
39 atoms
Cl 5.605553 -0.399424 0.990891
N  -1.018605 1.280668 -0.000617
N  -2.57817 3.754251 0.392521
C  -0.307916 0.179107 -0.719861
C  -2.480844 1.313406 -0.288752
C  -0.420293 2.615634 -0.291772
C  -3.168335 2.405072 0.56716
C  -1.105924 3.709553 0.563236
C  1.167552 0.097527 -0.293645
C  -0.980662 -1.183949 -0.482441
C  2.154108 -0.279028 -1.23578
C  1.561204 0.327779 1.04883
C  -1.294977 -2.021943 -1.578603
C  -1.259486 -1.641608 0.830689
C  3.507036 -0.435995 -0.857457
C  2.907317 0.182226 1.44679
C  -1.871995 -3.296871 -1.372671
C  -1.84129 -2.909663 1.039947
C  3.860812 -0.203731 0.484506
C  -2.146945 -3.745296 -0.061364
H  -0.326283 0.363763 -1.826635
H  -2.917885 0.327297 -0.057993
H  -2.668308 1.521859 -1.375887
H  -0.532227 2.870751 -1.379348
H  0.660115 2.586763 -0.067949
H  -4.245754 2.448531 0.32457
H  -3.072476 2.126119 1.634019
H  -0.891946 3.507104 1.630303
H  -0.682882 4.700197 0.31585
H  -2.835625 4.158398 -0.520385
H  1.86902 -0.460587 -2.279188
H  0.804707 0.641732 1.776044
H  -1.091904 -1.67533 -2.599859
H  -1.029936 -0.992246 1.682326
H  4.265482 -0.72909 -1.58911
H  3.209011 0.363689 2.482561
H  -2.109134 -3.934226 -2.232041
H  -2.053998 -3.24982 2.059862
H  -2.594619 -4.73202 0.101953
