program: Gaussian 09
title: 000095118
version: EM64L-G09RevD.01
frameworkgroup: C1[X(C8H12O4)]
method: RPBEPBE
basis: SDD
operation: Freq
keyword: #pfreq=noraman
keyword: PBEPBE/SDD
title: #p freq=noraman PBEPBE/SDD
converged: YES YES NO NO
title: Mulliken charges:
elementType: O O O O C C C C C C C C H H H H H H H H H H H H
charge: -0.254768 -0.254771 -0.245370 -0.245373 -0.224639 -0.224640 0.219147 -0.671714 -0.671716 0.189093 0.189096 -0.596179 0.230263 0.233058 0.230264 0.233058 0.212053 0.229211 0.232159 0.212054 0.229211 0.232158 0.259173 0.259173
chargesum: 0.00000
title: Mulliken charges with hydrogens summed into heavy atoms:
elementType: O O O O C C C C C C C C
charge: -0.254768 -0.254771 -0.245370 -0.245373 0.238681 0.238682 0.219147 0.001709 0.001708 0.189093 0.189096 -0.077833
polarizability: 1.03415380e+02 1.05582741e-04 1.26991066e+02 8.03544319e+00 -1.12587408e-04 7.32662790e+01
1716.lowfreq: -10.5623 -7.3878 -0.0008 -0.0005 0.0004 9.2460 35.1650 39.6606 57.4614
frequency: 34.9851 39.3204 57.4614 63.2566 82.0549 111.6406 128.5626 146.8618 229.0707 240.2188 259.6044 286.7292 302.6250 349.3187 360.4798 415.1764 454.6598 484.8418 639.4308 701.0587 754.7673 778.9333 799.2577 799.2766 802.6500 818.7460 867.5220 922.0518 1016.6074 1022.9261 1024.2135 1097.9187 1112.8436 1113.5758 1134.2899 1134.3369 1176.4902 1249.4194 1249.6448 1272.7481 1354.4618 1359.9850 1400.6656 1401.2690 1406.8893 1462.4940 1463.7429 1472.2034 1474.1210 1485.8858 1486.1129 1607.5052 1618.8357 1633.4004 2997.2837 2997.5492 3011.2798 3011.4224 3070.0102 3070.1582 3094.2308 3094.3884 3109.1688 3109.5064 3113.5636 3230.7623
redmass: 3.1605 3.7924 4.7535 3.5471 2.5345 2.2382 3.7760 2.7553 2.1192 1.2615 1.9108 4.4683 2.8486 3.9070 3.6854 8.9235 5.9289 4.2922 2.2072 4.6379 6.7858 1.8712 1.1145 1.1930 3.3136 3.4862 4.8737 2.5974 1.4121 2.3595 2.3454 3.6347 2.2217 2.2606 1.4622 1.4625 7.1907 1.1362 1.1361 3.7224 1.3582 1.4746 1.2711 1.2462 1.2293 1.0399 1.0399 1.0611 1.0656 1.0685 1.0656 11.8514 11.3914 5.5495 1.0358 1.0359 1.0582 1.0582 1.1066 1.1066 1.0986 1.0986 1.1026 1.1025 1.0611 1.1167
irintensity: 0.2169 1.8706 0.0010 0.6212 1.0028 9.6320 1.7440 0.0181 5.3676 0.0866 4.8821 9.6991 1.0456 11.6396 3.3551 0.1506 3.6352 4.7929 2.4043 7.4598 18.2541 0.4141 4.4950 1.3607 0.5051 13.4269 20.7268 11.4448 37.3879 59.5942 47.4025 213.7980 8.6462 5.7991 12.4094 2.3737 526.9678 0.1278 0.4311 71.0404 7.4098 0.9525 10.7553 72.5931 47.5200 17.7298 6.7576 4.5313 2.1114 0.2908 26.1455 303.1982 38.9019 41.5854 30.1705 8.9754 35.2609 0.2436 2.6714 12.6308 3.0528 56.5210 17.4916 67.7700 0.4230 0.1510
temp: 298.150 k
press: 1.00000 atm
elementType: 8 8 8 8 6 6 6 6 6 6 6 6 1 1 1 1 1 1 1 1 1 1 1 1
symmnumber: 1
zpe: 496883.7 jmol-1
zpe.correction: 0.189253 hartree
zpe.thermalcorrener: 0.203300 hartree
zpe.thermalcorrenthalpy: 0.204245 hartree
zpe.thermalcorrgfe: 0.146647 hartree
zpe.sumelectzpe: -611.989857 hartree
zpe.sumelectthermal: -611.975810 hartree
zpe.sumelectthermalent: -611.974866 hartree
zpe.sumelectthermalfe: -612.032463 hartree
dipole: 0.0001 -2.6332 -0.0001
dipole: 2.6332
quadrupole: -67.1061 -62.1457 -76.5374
quadrupole: 0.0003 -7.9120 -0.0002
quadrupole: 1.4903 6.4507 -7.9410 0.0003 -7.9120 -0.0002
hfenergy: -612.1791103 hartree
pointgroup: C01 [X(C8H12O4)]
dipole: -0.0003133 1.0359914 -0.0000485 debye
dipolederiv: -0.6572775 0.4417906 -0.0499891 0.465998 -1.257277 0.3788706 -0.0925132 0.4189306 -0.4796653 -0.6567462 -0.4414238 -0.0497363 -0.4656469 -1.2578719 -0.378856 -0.0922361 -0.4189288 -0.4795985 -0.7198924 -0.1225828 0.310274 0.0926504 -0.589758 0.1631423 0.1861979 0.2835503 -0.5891126 -0.7199394 0.12254 0.3103434 -0.0927025 -0.5897732 -0.1629555 0.1863793 -0.2834366 -0.5890599 0.5583419 -0.3596806 0.1179177 -0.2729836 0.6396812 -0.0447052 0.07048 -0.013731 0.3066527 0.5579686 0.3596486 0.1178705 0.2729429 0.6400519 0.0447533 0.0704602 0.0137639 0.3066585 -0.2388033 0.0000393 0.0579323 0.0000435 -0.4249734 0.0000245 0.1121732 0.0000376 -0.1012104 0.0403582 0.0313128 -0.0092238 0.0381178 -0.0983097 0.0798001 0.0006491 0.0688638 0.016156 0.0403978 -0.0312375 -0.0091768 -0.0380409 -0.0983557 -0.0798002 0.0006904 -0.0688581 0.0161612 1.0058308 -0.2474914 -0.3390283 -0.5357812 1.3559845 -0.484082 -0.2089293 -0.6019472 0.7718412 1.0054107 0.2472457 -0.3393087 0.5355458 1.3565306 0.4838437 -0.2093177 0.6017749 0.7717178 -0.0860867 -0.0000479 -0.0788791 -0.0000373 0.0714378 -0.0000257 -0.0146553 -0.0000132 -0.2257689 -0.100661 0.0067729 -0.043854 -0.0782898 -0.0654511 -0.0130283 -0.0295351 -0.0264834 0.0645134 0.0145182 0.0772904 -0.0380098 0.0496261 -0.0036725 0.0059017 0.0257924 -0.0453507 -0.1212189 -0.1006949 -0.0067976 -0.0438599 0.0782691 -0.065406 0.0130113 -0.0295525 0.0264715 0.0645114 0.0145905 -0.0772854 -0.0380015 -0.0496157 -0.0037456 -0.0059275 0.0257685 0.0453575 -0.1212242 -0.0728135 0.1362731 0.0283749 0.1199085 -0.0092509 0.0060048 0.038454 -0.0048708 0.0939189 -0.043691 -0.1466632 -0.0365214 -0.097899 0.0328656 -0.0169274 -0.0612828 -0.0188484 0.0660708 0.1150547 -0.026639 0.0266297 -0.0054575 0.0750619 -0.0697245 -0.0019929 -0.0174619 -0.1283738 -0.0726664 -0.1363074 0.028385 -0.1199428 -0.0093969 -0.0059837 0.0384574 0.0048975 0.0939196 -0.0438302 0.1466187 -0.0365372 0.0978532 0.0330057 0.0169078 -0.0612981 0.0188142 0.0660695 0.1150369 0.0266638 0.0265885 0.0054806 0.075084 0.0697304 -0.0020035 0.0174512 -0.1283783 0.0227654 0.0641113 0.0439066 0.0526454 0.0968018 -0.0064099 0.0239089 -0.016356 0.1627114 0.0228285 -0.0641504 0.0439034 -0.0526843 0.0967369 0.0064352 0.0239053 0.0163731 0.1627084 unknown
polarizability: 103.7387261|-0.0066445|126.9910637|-7.3969756|-0.0032461|72.9429347 unknown
InChI: InChI=1S/C8H12O4/c1-4-11-7(9)6(3)8(10)12-5-2/h3-5H2,1-2H3
charge 0 multiplicity 1
24 atoms
O  -1.377611 0.428034 -0.331806
O  1.377267 0.428859 0.331838
O  -2.150462 -1.21527 1.129689
O  2.151126 -1.214118 -1.129492
C  -2.618888 1.220302 -0.066808
C  2.618097 1.221822 0.066815
C  0.000392 -1.497372 0.00007
C  -2.525994 2.47727 -0.924219
C  2.524488 2.478773 0.92417
C  -1.263456 -0.771085 0.36048
C  1.263842 -0.770393 -0.360337
C  0.000768 -2.858142 0.00008
H  -3.491956 0.59258 -0.321842
H  -2.659277 1.44268 1.014743
H  3.491517 0.594603 0.321878
H  2.658365 1.444175 -1.014746
H  -3.421112 3.105414 -0.764437
H  -1.633339 3.068851 -0.658619
H  -2.4680 2.220715 -1.995605
H  3.419246 3.107421 0.76436
H  1.631497 3.069838 0.658548
H  2.466643 2.222232 1.995568
H  0.8996 -3.413198 -0.287058
H  -0.897753 -3.413693 0.287229
