program: Gaussian 09
title: 000095111
version: EM64L-G09RevD.01
frameworkgroup: C1[X(C11H15Cl2N)]
method: RPBEPBE
basis: SDD
operation: Freq
keyword: #p
keyword: freq=noraman
keyword: PBEPBE/SDD
title: #p freq=noraman PBEPBE/SDD
converged: YES YES NO NO
title: Mulliken charges:
elementType: Cl Cl N C C C C C C C C C C C H H H H H H H H H H H H H H H
charge: -0.051928 -0.071599 -0.217512 0.304323 -0.374429 -0.323718 0.306917 -0.335465 -0.574965 -0.601626 -0.365038 -0.825290 -0.248423 -0.255267 0.219579 0.262335 0.228774 0.229000 0.233708 0.264042 0.263656 0.293993 0.266525 0.227296 0.224482 0.238300 0.230096 0.225775 0.226458
chargesum: 0.00000
title: Mulliken charges with hydrogens summed into heavy atoms:
elementType: Cl Cl N C C C C C C C C C C C
charge: -0.051928 -0.071599 -0.217512 0.304323 0.107485 0.134056 0.306917 -0.101758 -0.047268 -0.041108 -0.137743 -0.132411 -0.022648 -0.028808
polarizability: 1.55908747e+02 -2.60744777e+01 1.28728551e+02 2.05134261e+00 1.36958628e+01 1.38624471e+02
1716.lowfreq: -12.2711 -6.6217 -0.0014 0.0004 0.0019 5.2592 22.4002 39.8566 49.2865
frequency: 21.4454 39.7106 49.2659 54.5787 86.0756 110.4285 137.2380 182.7175 214.5273 219.6646 249.4219 264.2187 299.3222 356.1455 359.4039 436.8671 447.9446 477.9469 535.8825 559.0676 568.5281 609.9115 675.5910 701.9358 720.8938 761.9161 785.2247 802.8502 857.6366 869.1948 923.0682 938.4751 965.8667 977.7551 981.8512 1009.0746 1043.2040 1050.2981 1055.7747 1061.6497 1114.2610 1123.8221 1164.3003 1174.8390 1203.4061 1219.1946 1230.6153 1252.0641 1281.0994 1287.0267 1296.2217 1327.5144 1363.6503 1370.3434 1382.3534 1394.2183 1434.8382 1439.4164 1445.4184 1457.8904 1471.0211 1484.6110 1491.4844 1493.8725 1582.8990 1609.7997 2932.3234 2949.5295 2965.5045 3042.1238 3045.4325 3046.5078 3068.8732 3083.5693 3094.4701 3116.2222 3128.3380 3128.6134 3145.8650 3155.5260 3163.0870
redmass: 9.3869 5.0878 7.1419 6.2974 2.3836 5.3581 3.1603 4.1028 1.0865 2.9117 2.7477 4.0759 3.3951 2.7085 3.2951 2.8423 3.4927 3.1567 4.4148 3.6157 4.2668 4.9461 5.2505 4.7274 2.3024 1.5117 1.1717 3.9753 1.3595 2.0548 2.3357 1.3834 2.3191 1.3413 1.5516 1.4844 1.5360 2.4126 2.3518 2.6550 1.8553 1.5067 1.4338 1.0711 1.8773 1.9953 1.7857 1.1810 1.2363 1.4087 1.4064 1.3343 1.3807 4.7188 1.4884 1.2527 1.7895 1.2411 1.0932 1.0918 1.0902 1.3333 1.7633 1.1078 6.3341 6.1514 1.0703 1.0678 1.0405 1.0928 1.0905 1.0595 1.0563 1.0995 1.0913 1.0873 1.1033 1.0923 1.0932 1.1119 1.1007
irintensity: 1.1711 0.3897 0.6984 1.2810 2.6500 2.3369 0.4772 3.2566 0.3500 3.2855 6.7134 0.3914 0.3159 0.2829 4.1531 8.1741 15.1921 4.4118 10.5202 3.5791 5.4299 13.2970 42.2972 26.0611 14.7704 68.0351 5.7482 5.0006 0.8821 0.9325 18.4472 0.8981 20.0369 1.6531 1.9945 2.9163 9.6315 9.2437 4.4117 2.2196 36.4664 41.5422 12.5325 0.7387 2.2246 28.4295 47.7777 13.3934 2.3605 4.3039 20.7622 26.3793 7.0546 1.0664 8.5522 11.8093 29.4944 8.7126 11.2027 6.3607 9.8667 14.7807 73.9259 18.0067 12.1052 27.3032 55.5413 41.8744 40.0472 13.7900 28.1036 36.2664 14.5995 18.8354 1.9978 12.5568 22.4752 4.4425 31.7307 8.8217 23.3811
temp: 298.150 k
press: 1.00000 atm
elementType: 17 17 7 6 6 6 6 6 6 6 6 6 6 6 1 1 1 1 1 1 1 1 1 1 1 1 1 1 1
symmnumber: 1
zpe: 619813.6 jmol-1
zpe.correction: 0.236075 hartree
zpe.thermalcorrener: 0.251061 hartree
zpe.thermalcorrenthalpy: 0.252005 hartree
zpe.thermalcorrgfe: 0.191373 hartree
zpe.sumelectzpe: -1401.962304 hartree
zpe.sumelectthermal: -1401.947318 hartree
zpe.sumelectthermalent: -1401.946374 hartree
zpe.sumelectthermalfe: -1402.007006 hartree
dipole: 0.7747 0.9500 2.7258
dipole: 2.9887
quadrupole: -110.2320 -95.6267 -92.9883
quadrupole: -9.1030 1.6100 6.3302
quadrupole: -10.6163 3.9889 6.6274 -9.1030 1.6100 6.3302
hfenergy: -1402.1983789 hartree
pointgroup: C01 [X(C11H15Cl2N1)]
dipole: 0.1578489 0.3326287 -1.1167241 debye
polarizability: 171.7244576|-7.4618824|111.2259696|-1.547238|-9.3467038|140.3113417 unknown
InChI: InChI=1S/C11H15Cl2N/c1-10-4-2-3-5-11(10)14(8-6-12)9-7-13/h2-5H,6-9H2,1H3
charge 0 multiplicity 1
29 atoms
Cl 0.921246 3.128467 0.884181
Cl 2.95688 -3.155983 1.216436
N  0.924958 0.041606 -0.459277
C  -0.464299 -0.027996 -0.084806
C  1.432121 1.227529 -1.171613
C  1.924305 -0.71126 0.323619
C  -1.485756 0.001366 -1.089403
C  -0.835972 -0.182576 1.279421
C  2.125949 2.297071 -0.308241
C  1.662368 -2.219893 0.20385
C  -2.839803 -0.072186 -0.675964
C  -1.161128 0.0509 -2.572766
C  -2.188595 -0.276454 1.661845
C  -3.203676 -0.206356 0.681321
H  2.184685 0.912255 -1.929691
H  0.601774 1.701409 -1.716933
H  2.923148 -0.497897 -0.099681
H  1.96592 -0.423097 1.395761
H  -0.060664 -0.199193 2.05256
H  2.927164 1.886593 0.325044
H  2.522991 3.107751 -0.940585
H  0.689076 -2.514907 0.619978
H  1.76814 -2.573361 -0.831584
H  -3.622042 -0.050848 -1.445221
H  -1.089269 1.087367 -2.9589
H  -0.197729 -0.44787 -2.78181
H  -1.950432 -0.453053 -3.157203
H  -2.447149 -0.386472 2.721006
H  -4.259211 -0.269913 0.966658
