program: Gaussian 09
title: 000095063
version: EM64L-G09RevD.01
frameworkgroup: C1[X(C8H6Br2O2)]
method: RPBEPBE
basis: SDD
operation: Freq
keyword: #p
keyword: freq=noraman
keyword: PBEPBE/SDD
title: #p freq=noraman PBEPBE/SDD
converged: YES YES NO NO
title: Mulliken charges:
elementType: Br Br O O C C C C C C C C H H H H H H
charge: 0.037833 -0.033393 -0.260131 -0.254982 0.201050 0.198291 0.661854 -0.447246 -0.284692 -0.382532 -0.200876 -0.865821 0.267931 0.278873 0.244800 0.245848 0.301834 0.291358
chargesum: 0.00000
title: Mulliken charges with hydrogens summed into heavy atoms:
elementType: Br Br O O C C C C C C C C
charge: 0.037833 -0.033393 -0.260131 -0.254982 0.201050 0.198291 0.661854 -0.179315 -0.005819 -0.382532 0.289772 -0.272629
polarizability: 1.89891731e+02 -4.74869341e+00 1.26187185e+02 -8.66303971e-01 -4.83105164e+00 7.14665245e+01
1716.lowfreq: -46.5925 -5.6802 -2.6616 -0.0005 0.0000 0.0004 1.6467 33.1317 61.5080
frequency: -46.4649 33.1022 61.5040 96.7125 160.9679 198.8991 248.7010 257.4751 311.9513 337.8396 416.5269 438.5136 513.3688 521.7976 644.6843 662.1614 681.5632 713.3714 742.7743 791.1604 837.3430 856.8826 875.1853 880.2306 943.7631 976.5591 1062.0417 1071.3822 1101.2911 1119.6052 1176.2178 1205.5736 1235.4425 1261.0588 1360.2035 1378.2447 1415.2331 1456.8529 1465.8496 1484.3504 1601.0181 1619.9496 3023.8498 3077.0513 3105.8042 3162.6014 3173.6058 3196.8916
redmass: 2.2804 17.4906 12.0945 10.8487 11.2079 8.3680 6.6184 6.9108 3.5548 9.9506 3.4027 4.7227 4.9381 6.4504 7.5128 8.8811 9.9732 4.0758 6.2004 5.5720 9.5401 1.4187 1.4700 1.5101 5.1768 4.8881 1.4571 3.5655 1.2074 1.0366 1.8772 1.1625 1.3007 6.5955 1.4781 3.0928 5.7143 1.1753 2.5592 1.3052 8.7709 8.9534 1.0534 1.0578 1.1193 1.1107 1.0934 1.0938
irintensity: 14.3695 0.2222 0.5967 0.3009 2.0231 0.6644 2.6668 2.0514 2.4395 4.6719 3.0726 25.0331 10.7758 82.8999 16.3796 5.5884 1.3791 0.9883 1.6336 9.2856 37.1260 8.2217 30.4084 18.4593 80.9508 108.6007 4.4335 50.4499 14.7810 0.0087 8.4579 69.6240 7.6834 242.8899 5.1168 44.9282 29.3664 10.2255 213.2183 38.9309 6.1359 23.5189 114.6519 12.0966 26.1326 0.3683 1.0324 0.9561
temp: 298.150 k
press: 1.00000 atm
elementType: 35 35 8 8 6 6 6 6 6 6 6 6 1 1 1 1 1 1
symmnumber: 1
zpe: 316754.1 jmol-1
zpe.correction: 0.120645 hartree
zpe.thermalcorrener: 0.131043 hartree
zpe.thermalcorrenthalpy: 0.131987 hartree
zpe.thermalcorrgfe: 0.081315 hartree
zpe.sumelectzpe: -484.921098 hartree
zpe.sumelectthermal: -484.910701 hartree
zpe.sumelectthermalent: -484.909756 hartree
zpe.sumelectthermalfe: -484.960428 hartree
dipole: 3.7113 -0.0658 1.3609
dipole: 3.9535
quadrupole: -78.4747 -90.2926 -86.5448
quadrupole: -5.0360 -4.3608 -1.7991
quadrupole: 6.6293 -5.1885 -1.4408 -5.0360 -4.3608 -1.7991
hfenergy: -485.0417436 hartree
pointgroup: C01 [X(C8H6Br2O2)]
dipole: 1.4105099 -0.0407145 0.6542988 debye
dipolederiv: -0.3377924 0.3150609 0.0243549 0.2796956 -0.3284741 -0.0026326 0.0044287 -0.0000469 -0.0139122 -0.5640646 -0.2536607 -0.1324008 -0.2826141 -0.28046 -0.1047199 -0.525323 -0.3141846 -0.387483 -1.4319959 0.2267892 0.0710122 0.3465627 -0.4568676 0.0150395 0.0896084 0.0119087 -0.2580451 -1.6354601 0.0230391 0.0528461 0.0157125 -0.4298062 0.0227442 0.16715 0.0278601 -0.2539116 0.8521247 -0.3883153 -0.0295074 -0.989279 0.0973651 0.0281638 0.0633514 0.0367147 0.0576793 1.2830932 0.0785945 -0.0766352 0.5167168 0.0651811 -0.0351987 -0.2358524 -0.0152705 0.0661468 -0.4990455 -0.0491053 -0.024854 0.0188931 -0.2509591 -0.0468182 0.1906809 0.1114685 -0.0881261 0.0455996 0.1307811 -0.0109606 -0.0507198 0.0111917 -0.0436901 -0.0404678 -0.0331873 -0.1383854 -0.4600411 0.0298551 -0.005855 0.2537138 -0.0626083 -0.0224567 0.0055058 -0.0071782 -0.0870665 0.6321019 -0.5275983 -0.0431453 -0.4029944 0.6291208 0.0367051 -0.0462671 -0.0751273 -0.140572 1.2673577 -0.0881557 -0.0376458 -0.1700904 0.5165582 -0.0040176 -0.0674331 0.0181337 0.567718 0.8285977 0.5014235 0.3106515 0.4282046 0.3314823 0.1962979 0.5092301 0.3119476 0.5237763 0.0863092 -0.0068806 0.0222512 0.0014957 -0.0172385 0.0251084 0.0040684 0.0236353 0.157244 0.1014605 -0.0160807 0.0082054 -0.0192038 0.0188178 0.0240096 0.0164747 0.0280693 0.1749694 -0.12641 0.0120074 -0.0601575 0.0089185 0.0717409 -0.0090742 -0.155616 -0.0013035 -0.0353122 -0.0727155 0.0230041 0.0508992 0.0557832 0.0604656 -0.0293218 0.1583861 -0.0434818 -0.0767921 -0.0086031 -0.0260919 -0.02942 0.051041 0.0533143 -0.0965225 -0.0522461 -0.0994616 -0.0132982 0.0394837 0.0153336 -0.0896388 -0.0618362 -0.0288239 0.0463839 -0.085679 0.0195037 -0.0546293 unknown
polarizability: 189.5487441|-1.6514968|125.9420046|8.89691|4.3046603|72.0546919 unknown
InChI: InChI=1S/C8H6Br2O2/c9-3-5-1-7-8(2-6(5)10)12-4-11-7/h1-2H,3-4H2
charge 0 multiplicity 1
18 atoms
Br -2.546483 2.285067 0.098691
Br -3.543381 -1.56943 -1.093314
O  2.363278 -1.387621 0.102284
O  2.674302 0.96228 -0.307982
C  1.124424 -0.706926 0.141823
C  1.310787 0.672047 -0.099223
C  -1.264976 -0.359695 0.38027
C  -0.135625 -1.242475 0.383229
C  0.24274 1.570269 -0.111076
C  -1.043792 1.023063 0.132647
C  3.383775 -0.346389 -0.198498
C  -2.615914 -0.933875 0.647462
H  -0.276339 -2.312646 0.556732
H  0.390406 2.635157 -0.297659
H  4.101507 -0.292866 0.63692
H  3.858828 -0.575926 -1.167029
H  -3.333308 -0.21195 1.058384
H  -2.579228 -1.850683 1.251139
