program: Gaussian 09
title: 000095056
version: EM64L-G09RevD.01
frameworkgroup: C1[X(C12H15NO)]
method: RPBEPBE
basis: SDD
operation: Freq
keyword: #p
keyword: freq=noraman
keyword: PBEPBE/SDD
title: #p freq=noraman PBEPBE/SDD
converged: YES YES NO NO
title: Mulliken charges:
elementType: O N C C C C C C C C C C C C H H H H H H H H H H H H H H H
charge: -0.433472 -0.076022 -0.415078 -0.499895 0.317782 -0.391963 -0.388146 0.336149 -0.619052 -0.353454 -0.364009 -0.404586 -0.375012 0.284927 0.187755 0.214591 0.211427 0.225036 0.228890 0.180862 0.211806 0.185682 0.222160 0.226829 0.226323 0.243382 0.216615 0.247876 0.352598
chargesum: 0.00000
title: Mulliken charges with hydrogens summed into heavy atoms:
elementType: O N C C C C C C C C C C C C
charge: -0.080874 -0.076022 -0.012733 -0.063431 0.317782 0.017789 -0.176340 0.336149 0.015619 -0.127130 -0.120626 -0.187972 -0.127136 0.284927
polarizability: 2.22882951e+02 9.41944364e+00 1.35090112e+02 -1.81921952e+00 4.63032951e+00 7.84816716e+01
1716.lowfreq: -10.4140 -4.3930 -0.0008 -0.0005 -0.0004 1.4908 44.6982 55.1295 96.3672
frequency: 44.6853 55.1218 96.3594 138.4661 192.3301 210.1805 238.1750 252.6293 297.4754 325.1805 329.5929 353.8644 376.0222 410.4799 438.3996 463.6309 482.4282 524.0993 556.9319 630.3074 635.8355 717.1824 734.6769 782.9670 802.7730 809.3883 813.9441 840.5227 927.8098 937.3897 951.6267 956.1773 963.7722 993.6037 1004.4824 1043.3532 1074.8009 1084.1401 1107.3659 1113.4971 1146.3134 1147.6273 1182.7853 1186.4200 1207.3438 1243.5482 1250.0312 1266.4475 1290.5983 1312.0440 1315.8365 1340.7473 1360.9932 1374.9496 1386.2669 1426.0742 1431.3969 1450.1119 1456.5538 1463.7255 1478.4507 1480.4816 1507.2156 1588.5659 1625.1171 1665.0508 2775.6826 2834.9035 2851.9934 2972.4117 2975.3775 3015.5780 3025.7644 3029.9515 3075.1090 3110.8659 3119.7884 3143.9041 3148.6469 3171.5801 3581.3259
redmass: 3.3643 3.9465 4.1786 4.0078 1.9284 2.2119 1.3428 5.7816 3.0461 2.9706 2.3341 1.1176 3.1920 2.9420 3.5100 2.6883 5.7843 2.5787 3.1652 4.9523 6.9586 3.1906 4.6445 2.0457 1.6803 2.8272 1.3540 1.6183 1.6781 2.2249 2.4171 1.4325 2.0449 2.2065 2.4918 1.8638 2.0182 1.6791 1.4520 1.3384 1.3462 2.1224 1.1601 1.1228 1.5345 1.9405 2.4057 2.6974 1.5430 1.4225 1.3754 1.4704 2.0543 1.5984 3.4438 3.3165 1.1900 1.0966 1.0703 1.0611 1.1008 1.0596 2.7071 6.1089 6.2892 6.9087 1.0716 1.0680 1.0602 1.0600 1.0831 1.0718 1.0925 1.0958 1.1008 1.0886 1.0903 1.0882 1.0937 1.0962 1.0660
irintensity: 0.7340 0.0887 0.2520 1.2833 2.9905 0.3865 2.0947 0.3016 4.1785 1.2720 6.7840 145.7336 5.7238 0.3059 9.5032 9.3380 5.6637 15.9056 2.5767 14.5374 1.0589 2.2138 7.0617 10.2876 24.5771 16.9381 45.2018 28.8175 1.1423 1.6168 6.7011 0.8415 19.1044 3.8901 0.2312 11.2939 6.8279 16.1774 71.0747 3.9494 221.8118 32.3223 12.0496 4.6694 2.4704 7.6782 32.7792 1.5470 10.5841 19.9067 8.7356 0.1853 16.3138 23.7717 29.9585 15.3610 1.1129 6.2939 20.7546 11.4627 15.6039 9.6620 98.3944 5.5640 41.8359 6.3508 93.5080 56.2257 232.6000 27.8056 38.5587 54.4494 34.1665 44.9770 32.9062 27.3545 16.1637 14.6500 13.4888 7.8139 47.4498
temp: 298.150 k
press: 1.00000 atm
elementType: 8 7 6 6 6 6 6 6 6 6 6 6 6 6 1 1 1 1 1 1 1 1 1 1 1 1 1 1 1
symmnumber: 1
zpe: 634793.9 jmol-1
zpe.correction: 0.241780 hartree
zpe.thermalcorrener: 0.254694 hartree
zpe.thermalcorrenthalpy: 0.255638 hartree
zpe.thermalcorrgfe: 0.202499 hartree
zpe.sumelectzpe: -595.179508 hartree
zpe.sumelectthermal: -595.166595 hartree
zpe.sumelectthermalent: -595.165650 hartree
zpe.sumelectthermalfe: -595.218789 hartree
dipole: 0.7471 1.6739 1.1398
dipole: 2.1585
quadrupole: -75.4303 -74.7832 -88.9277
quadrupole: -8.6733 -0.1135 0.7550
quadrupole: 4.2835 4.9305 -9.2140 -8.6733 -0.1135 0.7550
hfenergy: -595.4212882 hartree
pointgroup: C01 [X(C12H15N1O1)]
dipole: -0.2943208 -0.6608402 0.4448143 debye
polarizability: 222.924869|9.2338119|135.1113699|1.5894457|-4.2925801|78.418495 unknown
InChI: InChI=1S/C12H15NO/c1-13-8-6-11(7-9-13)10-2-4-12(14)5-3-10/h2-6,14H,7-9H2,1H3
charge 0 multiplicity 1
29 atoms
O  5.025073 0.104227 -0.028583
N  -3.589787 0.096276 -0.266474
C  -2.920442 1.045447 0.648804
C  -1.459961 1.266497 0.212404
C  -0.727484 -0.057611 0.008835
C  -2.968319 -1.243357 -0.218989
C  -1.457629 -1.195147 -0.187576
C  0.762527 -0.047849 0.01445
C  -5.049891 0.036593 -0.084923
C  1.5276 -1.215796 0.292913
C  1.483772 1.151971 -0.255161
C  2.93578 -1.198082 0.283061
C  2.89092 1.187246 -0.270638
C  3.620632 0.00813 -0.00424
H  -2.939655 0.682618 1.710309
H  -3.471769 2.003714 0.619341
H  -0.939603 1.877068 0.976261
H  -1.4536 1.848209 -0.731001
H  -3.301477 -1.8167 -1.108533
H  -3.322609 -1.83166 0.674882
H  -0.956019 -2.155621 -0.362139
H  -5.358325 -0.342293 0.923853
H  -5.492138 -0.632124 -0.846029
H  -5.485211 1.04255 -0.22142
H  1.016307 -2.150178 0.548247
H  0.937221 2.075011 -0.47418
H  3.49697 -2.114047 0.51131
H  3.436383 2.110543 -0.486761
H  5.439232 -0.772735 0.166778
