program: Gaussian 09
title: 000095032
version: EM64L-G09RevD.01
frameworkgroup: C1[X(C11H11BrN2O)]
method: RPBEPBE
basis: SDD
operation: Freq
keyword: #p
keyword: freq=noraman
keyword: PBEPBE/SDD
title: #p freq=noraman PBEPBE/SDD
converged: YES YES NO NO
title: Mulliken charges:
elementType: Br O N N C C C C C C C C C C C H H H H H H H H H H H
charge: 0.025867 -0.240235 -0.130389 -0.284477 0.499397 0.450571 0.275303 -0.522310 -0.651197 -0.766917 -0.359196 -0.380471 -0.212576 -0.211268 -0.249728 0.244871 0.247379 0.274247 0.246501 0.265231 0.246093 0.283522 0.259578 0.230555 0.228266 0.231384
chargesum: 0.00000
title: Mulliken charges with hydrogens summed into heavy atoms:
elementType: Br O N N C C C C C C C C C C C
charge: 0.025867 -0.240235 -0.130389 -0.284477 0.499397 0.450571 0.275303 -0.522310 0.115300 -0.009091 -0.075674 -0.120893 0.017979 0.016997 -0.018343
polarizability: 2.24517259e+02 -9.16071489e-01 1.54361931e+02 -3.91969186e+00 -1.26461276e+01 8.47751428e+01
1716.lowfreq: -6.6708 -4.8306 -0.0005 -0.0005 0.0006 4.9484 46.5213 58.2794 85.8725
frequency: 46.5213 58.2732 85.8724 112.6688 127.9306 143.1291 162.0592 180.5718 225.4346 235.5510 271.3624 273.1349 300.7790 330.3665 401.5442 409.7720 448.3392 499.8907 572.0194 594.3099 612.4799 617.8550 644.9036 696.1893 704.1836 748.9428 770.9696 841.8617 865.1239 913.5796 970.6847 986.0291 990.9969 1003.4899 1022.3081 1030.9183 1039.3262 1045.6965 1088.7281 1099.3392 1131.6812 1172.7570 1184.3991 1196.0297 1212.9355 1314.6951 1324.7948 1366.2235 1386.3333 1405.6715 1434.6784 1444.8937 1457.3093 1468.3981 1476.5831 1483.4917 1493.2804 1589.4652 1598.1518 1608.3301 1641.7754 2975.4741 2983.5905 3063.5738 3086.3199 3108.5995 3125.8745 3129.8066 3140.5334 3152.9921 3166.7776 3191.3903
redmass: 7.7479 3.8974 5.6153 3.2111 1.1795 3.8217 4.0586 1.1505 3.7728 6.2760 4.3089 5.8189 3.6039 5.2753 5.7739 3.0456 4.9168 3.4418 5.1115 6.2913 5.9326 5.2800 5.0266 2.1690 9.9248 2.5462 2.6944 1.2533 3.8481 1.4051 1.3681 4.4235 1.4293 4.3326 2.6644 1.8903 2.1822 1.6557 1.6697 2.1216 1.7720 1.0530 1.1578 2.8020 7.1278 2.2390 1.9612 3.8494 7.2255 1.3126 1.2316 2.0788 1.0807 1.0829 1.0702 2.3390 1.1037 6.5909 7.3743 6.1580 12.2205 1.0420 1.0392 1.0969 1.0919 1.0975 1.1015 1.0853 1.0890 1.0943 1.0995 1.0961
irintensity: 1.5393 3.2501 0.7490 2.2261 0.4582 1.9426 3.8166 0.4752 0.1841 3.4914 0.1793 5.1439 1.9579 8.1435 6.1848 2.5672 2.5653 10.8118 17.8908 0.4914 7.9301 6.4864 13.9679 27.9616 9.6583 70.6887 32.9971 0.7872 18.8769 4.4436 1.2349 0.0822 0.5172 6.5879 34.9439 3.2799 37.5998 26.9619 12.1386 44.6776 34.4624 0.0986 1.5559 5.0673 34.2884 96.5957 59.9527 22.4563 3.9942 19.6020 9.5796 22.4816 23.2554 17.8245 12.4330 110.7801 6.3794 4.0600 21.3015 55.6371 310.0411 57.1522 22.4659 13.1699 12.5855 6.5926 9.2021 1.9402 9.2171 25.3401 22.7961 1.2999
temp: 298.150 k
press: 1.00000 atm
elementType: 35 8 7 7 6 6 6 6 6 6 6 6 6 6 6 1 1 1 1 1 1 1 1 1 1 1
symmnumber: 1
zpe: 518521.0 jmol-1
zpe.correction: 0.197494 hartree
zpe.thermalcorrener: 0.211742 hartree
zpe.thermalcorrenthalpy: 0.212686 hartree
zpe.thermalcorrgfe: 0.155288 hartree
zpe.sumelectzpe: -622.848115 hartree
zpe.sumelectthermal: -622.833867 hartree
zpe.sumelectthermalent: -622.832923 hartree
zpe.sumelectthermalfe: -622.890321 hartree
dipole: 1.7214 6.5854 0.6543
dipole: 6.8381
quadrupole: -86.9425 -92.3652 -96.8487
quadrupole: -5.5918 -0.4390 -0.8939
quadrupole: 5.1097 -0.3131 -4.7966 -5.5918 -0.4390 -0.8939
hfenergy: -623.0456091 hartree
pointgroup: C01 [X(C11H11Br1N2O1)]
dipole: -0.1874262 -2.6220947 0.5720367 debye
dipolederiv: -0.386684 -0.2332669 0.0996504 -0.1871849 -0.1363893 0.0532546 0.1486802 0.0667189 -0.0108848 -0.4618726 0.3141704 -0.0346152 -0.0206558 -1.176244 0.0833858 0.0223588 0.0591257 -0.334666 -0.5715205 -0.6377216 0.1436552 -0.5922586 -0.7300957 0.16142 -0.2619061 -0.2073711 -0.1014347 -1.2987188 -0.3588118 0.1267529 -0.327713 -0.3148747 0.0401835 0.3626395 0.2125567 -0.2396679 0.3418878 0.22684 -0.0839996 0.2154157 0.7069104 -0.0456468 0.0253698 0.0511528 -0.0074129 1.3228853 0.1038495 0.0616322 -0.0648456 -0.0380886 0.0692068 -0.0239712 -0.0231174 0.1090911 0.8860401 -0.4175784 -0.0418993 0.1037051 1.4134367 -0.0833187 -0.0183828 -0.0500054 0.2409518 0.3511218 0.8693792 -0.2314913 0.5364905 -0.319028 -0.0611583 -0.3057964 -0.1616089 -0.1612039 0.0795295 0.1397387 -0.0625207 0.1753625 0.4085796 -0.16195 0.0466345 -0.0470876 0.3619297 -0.0996992 0.0122833 0.0306093 0.1298803 -0.0568415 -0.0033055 -0.0237759 0.0090337 0.0802164 -0.2730999 0.0319312 0.0205605 0.2283663 -0.0112104 0.0756035 -0.0184824 0.0192737 -0.1145659 -0.2385283 -0.0493421 -0.0029336 -0.1636842 -0.1015541 0.0409291 -0.0422978 0.0748172 -0.1230023 0.1117701 -0.061904 -0.0176211 -0.0664755 0.0694346 0.1160977 -0.024152 0.0957932 -0.0790129 0.0384111 0.0193486 0.0255013 0.0717955 0.048238 0.1231101 0.0717334 0.119114 -0.0715599 -0.0086261 -0.0071645 0.0227772 -0.0343094 -0.1259521 0.0219583 -0.0110331 0.0197882 -0.1599168 0.0608462 -0.0172772 -0.0545304 -0.0608983 0.0008459 -0.0586239 0.009224 0.1225536 -0.1672852 0.0603862 0.1336827 0.0112565 0.0894688 -0.0317459 -0.0120053 0.0365292 -0.0352062 0.0551937 -0.0624153 -0.1076679 0.0315888 -0.0647377 0.1245609 -0.0066049 0.0019046 -0.0119774 0.075619 0.0697151 0.0438329 0.0014124 0.0650176 0.0302998 0.0586028 -0.0457989 0.0902777 -0.0720301 -0.0234699 -0.0190545 0.0479969 -0.0907297 0.0955705 0.0406577 0.0662297 0.0089876 0.1034522 0.0558703 -0.0402353 -0.0613161 0.0065519 -0.0468823 -0.0858355 -0.0177386 -0.1105756 0.0478804 0.1009092 -0.0535975 -0.0412121 -0.0392862 0.0675653 -0.0621017 -0.0408014 -0.0330122 0.1200727 0.0538602 0.0952222 0.0389586 0.0804009 0.0337612 -0.0703749 0.0719625 -0.0587794 0.1087539 0.0076908 0.0738955 0.0378684 0.0942907 -0.0057392 -0.0903959 0.0547253 -0.0825308 0.1061982 0.0231616 -0.0604988 -0.0459543 -0.0827723 -0.0122758 -0.1084346 -0.0648998 -0.1017919 0.0864913 -0.1394505 -0.000054 -0.0221268 -0.0011946 0.1077188 -0.0346541 -0.0189551 -0.026129 0.1467927 unknown
polarizability: 222.2429808|11.3668249|158.1482772|-8.6143469|4.0188657|83.2630749 unknown
InChI: InChI=1S/C11H11BrN2O/c1-8-10(12)11(15)14(13(8)2)9-6-4-3-5-7-9/h3-7H,1-2H3
charge 0 multiplicity 1
26 atoms
Br 3.932342 1.628878 -0.735236
O  0.667984 2.387744 -0.143078
N  0.978573 -1.161802 0.08424
N  0.218379 0.050203 0.186499
C  2.319835 -0.786744 -0.14761
C  -1.204381 0.024824 0.053574
C  1.065793 1.192982 -0.079524
C  2.386687 0.588836 -0.280257
C  0.651405 -2.226351 1.063758
C  3.408702 -1.816073 -0.197612
C  -1.962259 1.081094 0.620089
C  -1.851253 -1.02319 -0.651992
C  -3.366124 1.074873 0.482393
C  -3.257988 -1.024957 -0.762582
C  -4.022446 0.021425 -0.196536
H  0.910561 -1.925283 2.097761
H  1.21289 -3.133168 0.790525
H  -0.424147 -2.452898 1.015066
H  3.620193 -2.244225 0.800686
H  4.337174 -1.349677 -0.56303
H  3.146569 -2.646391 -0.87773
H  -1.448731 1.895784 1.135351
H  -1.252792 -1.802123 -1.136402
H  -3.948771 1.896036 0.913787
H  -3.754132 -1.835476 -1.307977
H  -5.11356 0.02068 -0.290762
