program: Gaussian 09
title: 000095545
version: EM64L-G09RevD.01
frameworkgroup: C1[X(C22H24N2O7)]
method: RPBEPBE
basis: SDD
operation: Freq
keyword: #p
keyword: freq=noraman
keyword: PBEPBE/SDD
title: #p freq=noraman PBEPBE/SDD
converged: YES YES NO NO
title: Mulliken charges:
elementType: O O O O O O O N N C C C C C C C C C C C C C C C C C C C C C C H H H H H H H H H H H H H H H H H H H H H H H H
charge: -0.277506 -0.283385 -0.430528 -0.211435 -0.414851 -0.311142 -0.250076 -0.378980 -0.402782 -0.226943 -0.145567 -0.400229 -0.609456 0.202789 -0.482135 0.530777 0.166730 -0.364064 -0.447075 0.291346 0.199855 -0.236759 -0.213786 -0.249812 -0.477922 0.472672 -0.386489 -0.370086 -0.225968 -0.228417 -0.233803 0.280736 0.306727 0.272889 0.230028 0.250812 0.222587 0.328146 0.268945 0.286821 0.366187 0.231651 0.235804 0.230226 0.239019 0.231985 0.242451 0.219911 0.392886 0.372658 0.233199 0.270121 0.226470 0.226365 0.228402
chargesum: 0.00000
title: Mulliken charges with hydrogens summed into heavy atoms:
elementType: O O O O O O O N N C C C C C C C C C C C C C C C C C C C C C C
charge: -0.277506 -0.283385 -0.037642 -0.211435 -0.042193 -0.311142 -0.250076 -0.050834 -0.036595 0.053793 0.161160 0.102688 -0.136057 0.202789 0.073631 0.530777 0.166730 -0.132413 -0.211271 0.291346 0.199855 -0.006533 0.025233 -0.017827 -0.015561 0.472672 -0.153289 -0.099965 0.000502 -0.002052 -0.005400
polarizability: 2.70617826e+02 -3.24604473e+01 2.74558846e+02 -7.22017880e+00 -1.41882807e+01 2.42614923e+02
1716.lowfreq: -7.9544 -2.6124 -0.0006 -0.0005 -0.0002 1.4603 8.8233 14.6943 18.9862
frequency: 8.2519 14.5121 18.2637 22.0414 29.2044 31.4476 36.4090 43.4833 47.9109 56.6484 59.2733 63.9374 81.6527 84.8059 93.5543 108.5943 130.2990 136.8008 149.5773 160.0220 191.0405 209.9602 231.5353 251.3292 265.6488 275.8983 314.3912 328.6500 341.1954 374.6879 391.2007 402.7298 404.3793 419.3844 448.2583 479.9533 493.4581 508.3581 518.3931 541.2758 565.1349 572.4732 591.4757 597.5941 610.1456 615.6809 617.4164 619.5893 623.6180 648.5475 676.5787 681.0463 692.9353 700.0993 703.0718 705.5066 749.5676 757.6578 758.7935 788.0309 804.4384 815.9782 850.3466 853.9476 857.7505 871.9050 880.2220 885.5166 900.1217 925.5227 930.6244 936.6583 969.5571 977.3748 981.3109 989.5725 990.7988 997.6496 998.2741 999.2496 1003.8197 1026.8295 1027.5856 1035.8795 1050.4589 1075.3004 1086.1399 1090.5745 1093.0327 1105.8816 1143.9222 1172.9935 1174.8659 1181.6379 1185.7030 1188.8782 1191.1568 1206.6209 1216.5464 1221.2248 1222.6214 1237.3787 1241.9641 1265.4411 1268.3978 1280.8327 1298.2906 1309.9442 1319.5727 1330.8461 1336.6533 1337.8055 1338.8565 1359.1244 1382.2533 1383.4098 1385.9939 1440.4696 1442.5004 1443.7313 1460.0471 1464.9027 1465.7609 1469.6429 1484.5925 1485.3218 1503.0950 1593.4264 1594.7714 1608.8631 1614.3718 1615.1965 1644.4490 1660.6977 1670.0947 2988.4382 2991.8676 2993.8716 3015.4289 3033.7825 3044.5710 3060.4693 3060.6098 3081.2695 3107.2180 3119.6178 3120.3849 3121.9265 3126.6565 3136.3517 3139.2093 3150.2597 3151.1079 3163.9992 3167.4230 3500.3782 3508.2216 3524.2604 3549.4075
redmass: 6.7900 6.4953 4.4281 5.1012 5.7722 9.8213 4.9102 6.4947 7.8533 5.7517 6.9771 5.8528 6.5956 6.2451 3.5464 4.6452 3.9155 6.1324 5.6884 5.7867 4.0900 7.1817 5.5150 5.9229 5.1216 5.5501 6.5430 3.2255 2.3291 3.0233 3.2400 2.8135 2.8116 4.2463 4.3706 3.4712 4.0340 3.7530 2.3174 4.0925 1.5519 3.8321 2.6228 2.2368 2.6755 4.3762 5.8112 3.7164 3.6888 1.4698 1.1811 4.9416 3.8745 4.2223 1.9053 2.2823 3.4840 2.0707 1.8598 1.9311 3.7790 3.4915 4.7336 1.2549 1.2584 1.9627 4.4422 3.8363 4.2961 1.9594 1.9164 1.8648 2.0010 1.3904 1.4309 4.8926 6.1357 3.1226 1.3987 1.3461 2.9510 2.1806 2.2150 2.4686 2.2709 2.4510 2.1794 1.5219 1.9868 2.7704 2.4197 1.0538 1.0640 1.3608 1.2843 1.1245 1.1327 2.0280 2.4354 1.6268 2.7455 1.5913 1.1741 1.5874 1.4604 1.1830 1.6260 1.3805 1.4844 1.2549 1.2599 1.3444 1.5812 1.4476 1.7264 6.9481 7.9030 1.8169 2.1795 1.1886 1.4164 1.1420 1.2118 1.3884 2.3031 2.2694 1.9546 6.0064 6.1090 6.9044 6.2108 6.0831 9.1472 8.1140 9.3499 1.0810 1.0666 1.0593 1.0622 1.0586 1.0907 1.0962 1.0952 1.1012 1.1073 1.0861 1.0880 1.0876 1.0874 1.0905 1.0921 1.0964 1.0956 1.1016 1.1013 1.0774 1.0638 1.0643 1.0775
irintensity: 0.1912 0.0565 0.2023 0.0560 0.4916 2.5107 0.2097 0.7314 0.6077 0.9504 2.5999 0.0169 0.2881 3.7109 2.0855 8.8014 0.6512 0.8581 7.2766 0.8613 3.7513 3.1726 9.2143 11.6685 5.9437 7.0088 8.8422 2.2652 2.5864 17.0604 11.7082 0.0927 0.1309 19.6342 9.9236 11.0880 5.9858 15.4982 38.5758 17.9666 13.5130 21.5659 107.1858 132.2755 33.6050 11.8726 3.4962 26.0937 19.5119 144.3338 102.7239 22.3121 24.0186 40.7261 36.1077 59.2135 12.1660 9.3376 70.8543 41.9853 18.7947 9.4076 5.9161 1.5441 0.1805 8.4831 64.1589 16.4905 15.5507 22.0567 12.2137 4.2704 35.2958 0.0886 4.3665 21.4618 0.4073 209.9364 20.1099 2.0313 25.2738 4.7424 5.9962 30.1543 188.0599 178.4747 45.7547 14.5048 41.2147 41.7499 46.2079 0.0559 0.1706 42.8957 1.2816 1.5077 1.4898 103.9159 2.7756 19.7906 30.7004 33.1051 7.3572 21.5238 8.7703 9.2014 41.3186 1.7304 2.7348 3.6448 1.4741 69.6442 62.5145 32.8591 31.3858 1.0291 0.4998 14.0819 10.1919 11.0130 274.3716 154.7813 225.9157 219.6726 11.7743 25.4420 88.2347 0.5158 3.1094 117.6570 19.6588 1.2472 234.6233 180.0957 247.9881 16.4017 2.3681 21.9171 16.6855 35.5286 6.8583 11.3174 0.1590 19.2531 6.1157 4.7772 5.0478 7.1611 1.8032 8.9783 19.3904 26.3181 26.7452 23.9246 15.5613 115.7860 22.2875 38.4194 35.0790
temp: 298.150 k
press: 1.00000 atm
elementType: 8 8 8 8 8 8 8 7 7 6 6 6 6 6 6 6 6 6 6 6 6 6 6 6 6 6 6 6 6 6 6 1 1 1 1 1 1 1 1 1 1 1 1 1 1 1 1 1 1 1 1 1 1 1 1
symmnumber: 1
zpe: 1129019.4 jmol-1
zpe.correction: 0.430021 hartree
zpe.thermalcorrener: 0.460342 hartree
zpe.thermalcorrenthalpy: 0.461286 hartree
zpe.thermalcorrgfe: 0.360737 hartree
zpe.sumelectzpe: -1486.594055 hartree
zpe.sumelectthermal: -1486.563734 hartree
zpe.sumelectthermalent: -1486.562790 hartree
zpe.sumelectthermalfe: -1486.663339 hartree
dipole: 1.1461 0.7657 -1.0779
dipole: 1.7498
quadrupole: -171.2295 -169.2373 -180.4519
quadrupole: -9.6435 -7.2227 -19.7156
quadrupole: 2.4101 4.4023 -6.8123 -9.6435 -7.2227 -19.7156
hfenergy: -1487.0240762 hartree
pointgroup: C01 [X(C22H24N2O7)]
dipole: 0.4556142 -0.3910965 0.3367264 debye
polarizability: 268.5386667|29.1614118|281.1028458|16.2094456|-3.1025003|238.1500821 unknown
InChI: InChI=1S/C22H24N2O7/c25-19(26)12-11-17(24-22(30)31-14-16-9-5-2-6-10-16)20(27)23-18(21(28)29)13-15-7-3-1-4-8-15/h1-10,17-18,23-25,28H,11-14H2
charge 0 multiplicity 1
55 atoms
O  0.831954 -0.341067 -1.655322
O  -3.318145 1.369703 -0.550433
O  1.92422 -4.24727 0.427453
O  3.067484 -4.571271 -1.572934
O  1.961258 4.402478 1.077134
O  -2.737634 0.625852 1.620755
O  2.326021 2.882372 2.789274
N  1.717844 -1.611248 0.087798
N  -1.250154 0.502277 -0.183939
C  -0.150014 -0.07948 0.587336
C  2.728585 -2.272557 -0.73867
C  0.551831 0.96088 1.513553
C  4.198341 -1.911982 -0.316905
C  0.834108 -0.689249 -0.432615
C  1.117802 2.169775 0.745169
C  4.482461 -0.421189 -0.408962
C  2.591087 -3.795013 -0.721724
C  4.545622 0.224417 -1.67124
C  4.688022 0.351133 0.761351
C  -2.450258 0.806903 0.403146
C  1.846211 3.130355 1.659693
C  4.808843 1.608178 -1.760272
C  4.954087 1.737644 0.677316
C  5.014225 2.370183 -0.585121
C  -4.699989 1.68572 -0.053757
C  -5.650223 0.526975 -0.26704
C  -6.424697 0.442116 -1.451556
C  -5.77889 -0.487413 0.717508
C  -7.311432 -0.63869 -1.654957
C  -6.664701 -1.568679 0.515235
C  -7.433269 -1.646869 -0.670441
H  -0.554189 -0.878421 1.240836
H  2.560909 -1.932288 -1.775928
H  -0.197212 1.296944 2.25266
H  1.363459 0.466983 2.078826
H  4.872406 -2.482866 -0.983342
H  4.370164 -2.272695 0.714906
H  1.605154 -1.932279 1.051547
H  0.321891 2.717388 0.211255
H  1.844384 1.849277 -0.028815
H  -1.102291 0.626852 -1.19126
H  4.388487 -0.35547 -2.589259
H  4.644088 -0.131634 1.745331
H  4.852028 2.092416 -2.742002
H  5.109369 2.315624 1.594724
H  5.217249 3.444389 -0.655188
H  -4.620858 1.955431 1.01358
H  -4.98314 2.563926 -0.655364
H  1.885963 -5.24164 0.424262
H  2.466648 4.996385 1.697101
H  -6.329826 1.222959 -2.21636
H  -5.172787 -0.424098 1.628521
H  -7.906358 -0.693974 -2.573521
H  -6.759133 -2.346964 1.280933
H  -8.122607 -2.484827 -0.824874
