program: Gaussian 09
title: 000095031
version: EM64L-G09RevD.01
frameworkgroup: C1[X(C10H12N4O2)]
method: RPBEPBE
basis: SDD
operation: Freq
keyword: #p
keyword: freq=noraman
keyword: PBEPBE/SDD
title: #p freq=noraman PBEPBE/SDD
converged: YES YES NO NO
title: Mulliken charges:
elementType: O O N N N N C C C C C C C C C C H H H H H H H H H H H H
charge: -0.267032 -0.267222 -0.162987 -0.219608 -0.403660 -0.062242 0.124677 0.068492 0.186464 0.123284 0.206414 -0.553796 -0.615338 -0.598964 -0.059019 -0.571644 0.348103 0.251651 0.239080 0.246336 0.272376 0.246496 0.267850 0.250403 0.250414 0.246429 0.227713 0.225331
chargesum: 0.00000
title: Mulliken charges with hydrogens summed into heavy atoms:
elementType: O O N N N N C C C C C C C C C C
charge: -0.267032 -0.267222 -0.162987 -0.219608 -0.055556 -0.062242 0.124677 0.068492 0.186464 0.123284 0.206414 -0.063065 0.149870 0.169703 0.187410 -0.118600
polarizability: 2.04391527e+02 6.04994248e+00 1.51990621e+02 6.94276440e+00 1.79271786e+00 7.87673670e+01
1716.lowfreq: -9.2114 -5.1698 -0.0008 -0.0007 -0.0005 3.9920 32.8978 55.5006 74.8000
frequency: 32.8437 55.4856 74.7888 80.1369 107.9573 112.4857 120.1127 149.6092 185.4356 204.9773 259.4906 297.6057 320.7328 336.3705 355.1924 370.5492 388.3130 416.0244 442.9686 484.9718 512.4900 607.8175 638.2829 664.1736 681.9083 704.8883 707.8912 744.4314 765.7144 770.4619 900.0850 926.5411 936.5741 961.5280 964.6260 988.9387 1010.6651 1040.1975 1101.5846 1106.3097 1130.0393 1132.3262 1182.1467 1205.3031 1209.9916 1226.5861 1263.2398 1272.8509 1290.6190 1298.8895 1372.8030 1381.2823 1416.9510 1424.9598 1427.2798 1449.4415 1463.2620 1473.4016 1478.1118 1478.6814 1481.8999 1524.3449 1578.0222 1615.1598 1655.2279 1659.2129 2987.6022 3007.1351 3012.0099 3051.2054 3088.8097 3096.4519 3102.6601 3104.3921 3137.3516 3139.0094 3201.4124 3574.2640
redmass: 3.8719 3.5953 1.7340 1.3797 1.4255 2.7411 2.8958 3.6598 4.4377 4.2945 3.7668 3.2672 4.7231 4.7512 3.8337 5.4161 6.3037 2.4807 5.4957 7.2862 4.2359 2.0225 6.2907 6.1094 6.9115 10.6440 1.2111 10.8126 4.6946 3.2680 1.4311 3.8160 2.6713 1.6304 2.2356 5.0248 1.1388 3.0973 1.7301 3.3992 1.3023 1.2998 2.6210 1.8034 1.6601 2.7390 4.3278 1.6414 1.3451 3.8514 4.3512 4.0032 1.3102 1.1900 1.3141 1.3644 1.9186 1.0439 1.0498 1.0814 1.3557 4.1111 8.2884 10.5279 5.3044 8.2735 1.0627 1.0335 1.0327 1.0967 1.0617 1.1025 1.0932 1.1022 1.1025 1.1012 1.1145 1.0820
irintensity: 0.2008 0.1139 0.2741 0.0997 1.8320 0.0817 3.2380 1.6154 12.4149 8.0299 2.1222 0.2346 2.3259 19.7429 3.2737 1.8967 21.2655 10.2662 9.1099 30.2558 1.8277 11.8248 0.6682 1.2840 4.1419 12.0620 92.6525 8.4229 2.4745 4.7217 6.0487 4.3329 5.9992 94.1691 28.2764 1.8818 23.4986 41.3296 8.5518 13.3660 0.3004 0.1363 20.2309 21.3403 54.0256 5.1358 27.8263 33.9029 11.7299 79.5109 27.2098 38.4115 24.2805 2.4978 73.0289 124.4861 104.4145 18.8317 11.8557 13.7529 107.3453 43.8025 3.3894 593.6107 97.4986 337.7529 14.5312 35.9584 27.6231 3.0581 11.1540 18.1086 7.3632 17.7383 0.7376 0.4689 20.8399 76.1898
temp: 298.150 k
press: 1.00000 atm
elementType: 8 8 7 7 7 7 6 6 6 6 6 6 6 6 6 6 1 1 1 1 1 1 1 1 1 1 1 1
symmnumber: 1
zpe: 568976.8 jmol-1
zpe.correction: 0.216712 hartree
zpe.thermalcorrener: 0.232072 hartree
zpe.thermalcorrenthalpy: 0.233017 hartree
zpe.thermalcorrgfe: 0.173217 hartree
zpe.sumelectzpe: -756.573361 hartree
zpe.sumelectthermal: -756.558000 hartree
zpe.sumelectthermalent: -756.557056 hartree
zpe.sumelectthermalfe: -756.616855 hartree
dipole: -4.4377 0.7781 -0.1151
dipole: 4.5069
quadrupole: -90.2754 -99.6493 -91.1562
quadrupole: 1.3037 0.5801 -0.3663
quadrupole: 3.4182 -5.9557 2.5375 1.3037 0.5801 -0.3663
hfenergy: -756.7900723 hartree
pointgroup: C01 [X(C10H12N4O2)]
dipole: 1.7615728 -0.1914531 -0.0650702 debye
polarizability: 203.5470588|10.0397357|151.712217|-4.4605241|9.6317486|79.8902392 unknown
InChI: InChI=1S/C10H12N4O2/c1-4-5-6-11-7-8(12-6)13(2)10(16)14(3)9(7)15/h4,11H,1,5H2,2-3H3
charge 0 multiplicity 1
28 atoms
O  -0.968433 2.698774 0.424825
O  -3.716295 -1.11264 -0.060969
N  -1.394445 -1.439823 -0.172541
N  -2.331505 0.764532 0.178235
N  1.408027 0.724261 0.060746
N  1.086621 -1.505671 -0.248477
C  0.024998 0.522427 0.070747
C  -0.137655 -0.857189 -0.124549
C  2.011658 -0.509636 -0.133588
C  -1.063413 1.445992 0.241716
C  -2.54842 -0.630858 -0.021886
C  3.503127 -0.687819 -0.240202
C  -1.541622 -2.892937 -0.382819
C  -3.558522 1.579379 0.333663
C  4.275254 0.247786 0.675239
C  5.131218 1.209504 0.247527
H  1.881598 1.619444 0.189292
H  3.717044 -1.744171 0.005779
H  3.82389 -0.534516 -1.289456
H  -1.097529 -3.182569 -1.349957
H  -2.616927 -3.122351 -0.374689
H  -1.026686 -3.44503 0.421033
H  -3.241223 2.621922 0.482373
H  -4.141463 1.224439 1.199098
H  -4.188497 1.490766 -0.566407
H  4.106273 0.111726 1.753746
H  5.669389 1.852326 0.952624
H  5.329239 1.371531 -0.819703
