program: Gaussian 09
title: 000094983
version: EM64L-G09RevD.01
frameworkgroup: C1[X(C5H3ClN4O)]
method: RPBEPBE
basis: SDD
operation: Freq
keyword: #p
keyword: freq=noraman
keyword: PBEPBE/SDD
title: #p freq=noraman PBEPBE/SDD
converged: NO NO NO YES
title: Mulliken charges:
elementType: Cl O N N N N C C C C C H H H
charge: -0.004571 -0.213373 -0.367177 -0.286492 -0.068896 0.102326 0.094246 0.110215 0.041392 -0.197061 -0.190904 0.347886 0.357609 0.274800
chargesum: 0.00000
title: Mulliken charges with hydrogens summed into heavy atoms:
elementType: Cl O N N N N C C C C C
charge: -0.004571 -0.213373 -0.019291 0.071117 -0.068896 0.102326 0.094246 0.110215 0.041392 0.077739 -0.190904
polarizability: 1.32950233e+02 -3.73829318e+00 1.05786563e+02 -1.40880360e-02 1.18959226e-03 3.56936011e+01
1716.lowfreq: -3.0458 -0.0018 -0.0009 0.0011 1.4842 11.9538 97.6553 152.9283 211.0094
frequency: 97.6416 152.9275 211.0085 219.8029 289.9117 329.6317 337.5346 476.9810 539.0928 604.5237 607.7787 633.1080 644.2239 672.9058 702.8342 744.3368 771.0518 821.9351 876.5060 917.9247 974.8052 1081.8635 1123.3084 1169.0761 1245.2551 1308.5210 1334.4567 1385.2822 1417.0142 1520.0279 1524.7753 1599.1682 1630.4400 3253.3769 3549.7755 3583.2062
redmass: 6.8172 10.6295 8.8427 12.3701 8.5918 5.7900 16.2787 10.6454 8.3150 1.6896 4.4587 2.8731 9.6264 5.2943 1.2171 8.3788 8.0731 1.4738 10.4932 8.3675 5.7319 1.7519 3.3396 2.6365 2.6752 4.1516 3.4565 3.1079 2.4997 3.3842 11.4156 10.6503 11.3646 1.0996 1.0797 1.0827
irintensity: 1.3296 0.9580 2.6824 1.1310 10.9224 21.4513 27.8581 3.2025 9.9290 74.1277 23.8160 7.1370 1.2038 28.8057 135.4700 14.5360 0.0365 16.4480 84.6766 3.4648 2.7008 15.4133 80.9232 127.4214 22.4824 29.4353 31.9269 44.4700 143.6956 169.0826 76.8758 346.3947 411.7782 1.8216 100.9023 97.6732
temp: 298.150 k
press: 1.00000 atm
elementType: 17 8 7 7 7 7 6 6 6 6 6 1 1 1
symmnumber: 1
zpe: 229396.0 jmol-1
zpe.correction: 0.087372 hartree
zpe.thermalcorrener: 0.095654 hartree
zpe.thermalcorrenthalpy: 0.096599 hartree
zpe.thermalcorrgfe: 0.053385 hartree
zpe.sumelectzpe: -945.852322 hartree
zpe.sumelectthermal: -945.844039 hartree
zpe.sumelectthermalent: -945.843095 hartree
zpe.sumelectthermalfe: -945.886309 hartree
dipole: -3.7945 -4.1496 -0.0004
dipole: 5.6229
quadrupole: -54.8762 -83.8021 -69.6370
quadrupole: -6.3487 -0.0027 -0.0022
quadrupole: 14.5622 -14.3636 -0.1986 -6.3487 -0.0027 -0.0022
hfenergy: -945.9396939 hartree
pointgroup: C01 [X(C5H3Cl1N4O1)]
dipole: 1.8088592 1.2735719 -0.0001439 debye
dipolederiv: -0.8562566 0.4076755 -0.0000534 0.4371275 -0.3727752 0.0000355 -0.0000325 -0.0000157 -0.0724394 -0.4836173 0.1361619 -0.0000225 0.0413756 -1.3347596 -0.0002289 -0.0000975 0.0006041 -0.358686 -0.3539671 0.1370949 -0.0000004 0.1548758 -0.4761103 0.000059 -0.0000874 0.0000658 -0.2048661 -1.0133468 0.1347544 -0.0000326 -0.1202947 -0.6795238 0.0000044 -0.0000244 0.000109 -0.1924261 -0.6194096 0.1875567 -0.0000491 0.0272676 -0.3486173 -0.0000035 -0.0000193 0.0000444 -0.252162 -0.8227285 0.5106632 -0.0001584 0.6750652 -1.3875446 0.0000626 0.0001427 -0.0000311 -0.2169855 -0.072998 -0.4689444 0.0000521 -0.3357274 -0.5672832 -0.0000569 -0.0000292 -0.000181 0.0083696 0.7836389 -0.2105966 0.0000576 -0.0359761 0.3925781 0.0000795 0.0000677 -0.0000779 0.0786345 1.1699882 -0.250487 0.0001696 -0.1624231 1.9432457 0.0001483 0.0001254 -0.0003634 0.2644203 0.1159691 -0.1628067 0.0000775 -0.1711905 0.5786882 -0.0000612 -0.0000092 -0.0000821 -0.0510911 1.6722604 -0.3373792 0.0000572 -0.4889559 1.624372 -0.0000383 0.0000305 -0.0000823 0.0830221 0.2716511 -0.0707994 -0.000034 -0.0352674 0.2259326 -0.0000066 -0.0000188 -0.0000066 0.3619453 0.1839394 -0.0272624 -0.0000142 0.0064671 0.2847198 -0.0000076 -0.000024 0.0000013 0.3590979 0.0248769 0.0143692 -0.0000495 0.0076563 0.1170775 0.0000137 -0.0000239 0.0000153 0.1931665 unknown
polarizability: 130.1263309|-9.0943919|108.6104657|0.0135032|-0.0041895|35.6936011 unknown
InChI: InChI=1S/C5H3ClN4O/c6-5-9-3-2(4(11)10-5)7-1-8-3/h1,7,9H
charge 0 multiplicity 1
14 atoms
Cl -3.412894 1.229979 -0.00021
O  -0.178617 -2.73501 0.000439
N  2.149363 -0.652295 0.000433
N  -0.732766 1.399635 -0.000155
N  1.75647 1.594785 0.000221
N  -1.618331 -0.836212 -0.000187
C  0.759257 -0.505236 -0.000042
C  0.562555 0.889025 0.000017
C  -0.322775 -1.482315 -0.000454
C  2.702286 0.619003 0.000576
C  -1.7487 0.451966 -0.000169
H  2.637026 -1.548815 0.000526
H  -0.914656 2.405592 -0.000144
H  3.773183 0.804199 0.000849
