program: Gaussian 09
title: 000094973
version: EM64L-G09RevD.01
frameworkgroup: C1[X(C6H6O2)]
method: RPBEPBE
basis: SDD
operation: Freq
keyword: #p
keyword: freq=noraman
keyword: PBEPBE/SDD
title: #p freq=noraman PBEPBE/SDD
converged: YES YES NO NO
title: Mulliken charges:
elementType: O O C C C C C C H H H H H H
charge: -0.421663 -0.421661 -0.404877 -0.404881 0.012516 0.012524 -0.010723 -0.010726 0.226913 0.251198 0.226912 0.251199 0.346635 0.346636
chargesum: 0.00000
title: Mulliken charges with hydrogens summed into heavy atoms:
elementType: O O C C C C C C
charge: -0.075028 -0.075025 0.073233 0.073230 0.012516 0.012524 -0.010723 -0.010726
polarizability: 1.65661911e+02 -9.17354415e-04 4.23163343e+01 7.54321129e+00 -6.68925376e-04 4.54510036e+01
1716.lowfreq: -14.2753 -2.4821 0.0007 0.0007 0.0009 2.7023 18.5800 65.1562 74.6486
frequency: 18.3159 65.1520 74.5468 157.3572 165.0650 277.4161 277.9330 326.0873 350.0254 424.5740 470.3026 507.5074 542.4421 641.3705 879.6288 921.8412 967.8268 969.1908 971.8605 1164.4770 1169.5618 1279.8394 1288.6940 1289.1451 1364.3319 1372.6635 1447.6311 1447.6537 2172.9856 2290.5082 2953.3321 2953.5416 3058.4789 3058.5026 3557.9643 3558.2235
redmass: 2.9415 5.4125 3.4838 5.2720 3.2877 1.5525 3.7786 1.3728 2.2958 6.1177 9.0062 9.5240 9.2279 5.2797 4.7415 4.8475 1.7489 1.7181 4.9473 1.0903 1.0963 4.1244 1.2852 1.2018 1.1827 1.2803 1.0782 1.0767 11.7642 11.8668 1.0682 1.0682 1.0916 1.0916 1.0666 1.0666
irintensity: 1.8527 0.2138 2.8967 7.3148 1.6525 182.4809 23.7381 69.8671 146.0297 10.2059 3.5120 0.1610 6.1301 22.4671 59.2336 112.5422 34.0990 0.1808 89.9735 29.6155 18.8067 1.4687 9.9334 9.4284 128.5424 14.3087 6.4841 7.5230 10.7022 0.1580 20.0665 75.3255 1.5687 15.6451 17.2953 8.5408
temp: 298.150 k
press: 1.00000 atm
elementType: 8 8 6 6 6 6 6 6 1 1 1 1 1 1
symmnumber: 1
zpe: 265786.2 jmol-1
zpe.correction: 0.101233 hartree
zpe.thermalcorrener: 0.110873 hartree
zpe.thermalcorrenthalpy: 0.111817 hartree
zpe.thermalcorrgfe: 0.064790 hartree
zpe.sumelectzpe: -381.948401 hartree
zpe.sumelectthermal: -381.938761 hartree
zpe.sumelectthermalent: -381.937817 hartree
zpe.sumelectthermalfe: -381.984844 hartree
dipole: -0.0002 -2.4815 -0.0002
dipole: 2.4815
quadrupole: -52.8935 -48.9350 -40.0424
quadrupole: 0.0004 -4.2797 -0.0008
quadrupole: -5.6032 -1.6447 7.2479 0.0004 -4.2797 -0.0008
hfenergy: -382.0496338 hartree
pointgroup: C01 [X(C6H6O2)]
dipole: -0.0000984 0.0013926 -0.9762852 debye
dipolederiv: -0.8586236 -0.1771414 0.0079166 -0.3216875 -0.2955687 -0.1764515 -0.182666 -0.1322303 -0.5996875 -0.8586853 -0.1770845 -0.008411 -0.322154 -0.2964149 0.1773573 0.1817488 0.1331313 -0.5987893 0.8089863 0.0985066 0.0987719 0.2258191 0.3782504 0.1647429 0.2390461 0.1206516 0.5591989 0.8090375 0.0987909 -0.0985141 0.2265207 0.3790552 -0.1652687 -0.2384302 -0.1211749 0.5583826 -0.2433005 -0.0561064 -0.0652681 -0.0658434 -0.167506 -0.0604491 0.021068 -0.071704 -0.2093333 -0.2433163 -0.0563124 0.0651127 -0.0658225 -0.1678764 0.0605649 -0.021243 0.0718236 -0.2089531 0.0259102 -0.0190696 0.0111662 0.0148424 -0.0098378 0.032643 -0.0078166 0.0292419 -0.0003531 0.0258995 -0.0190144 -0.0112237 0.0148571 -0.0096621 -0.0326707 0.0078589 -0.0292689 -0.0005294 -0.0850028 -0.0294898 0.041898 -0.0764903 0.0745604 0.0603295 0.0219779 0.0080721 -0.1531821 -0.0332772 0.0417671 -0.0243396 0.0230489 -0.0599433 -0.0290537 -0.0823191 0.0228817 0.095567 -0.0850167 -0.0293658 -0.041988 -0.0764214 0.0747645 -0.0596647 -0.0222009 -0.0074091 -0.1533835 -0.0332791 0.0416888 0.024466 0.0228051 -0.0599652 0.0286006 0.082389 -0.0233346 0.0955839 0.3853088 0.1415129 -0.0555107 0.2003152 0.0800098 0.0196237 -0.0178337 0.0348514 0.3078216 0.3853592 0.1413181 0.055924 0.2002105 0.0801343 -0.0203033 0.0184209 -0.0355319 0.3076575 unknown
polarizability: 165.4572373|-9.0256272|45.6556692|-0.0147128|0.0052925|42.3163426 unknown
InChI: InChI=1S/C6H6O2/c7-5-3-1-2-4-6-8/h7-8H,5-6H2
charge 0 multiplicity 1
14 atoms
O  4.046346 0.274578 0.805172
O  -4.046354 -0.276891 0.804461
C  3.372956 -0.397966 -0.323242
C  -3.37293 0.398858 -0.322004
C  1.912309 -0.24168 -0.324025
C  -1.912292 0.242482 -0.323269
C  0.679736 -0.085971 -0.320671
C  -0.679722 0.086742 -0.320408
H  3.78203 -0.042423 -1.293584
H  3.645943 -1.461287 -0.20809
H  -3.782041 0.046167 -1.293373
H  -3.645832 1.461865 -0.203782
H  3.738414 1.216252 0.845648
H  -3.738565 -1.218727 0.842167
