program: Gaussian 09
title: 000095033
version: EM64L-G09RevD.01
frameworkgroup: C1[X(C16H16N4O2)]
method: RPBEPBE
basis: SDD
operation: Freq
keyword: #p
keyword: freq=noraman
keyword: PBEPBE/SDD
title: #p freq=noraman PBEPBE/SDD
converged: YES YES NO NO
title: Mulliken charges:
elementType: O O N N N N C C C C C C C C C C C C C C C C H H H H H H H H H H H H H H H H
charge: -0.266077 -0.267633 -0.163179 -0.406143 -0.219518 -0.060951 0.120533 0.064614 0.188606 0.119263 0.205999 -0.562552 -0.615448 -0.599415 -0.191924 -0.331679 0.488634 -0.394505 -0.396711 -0.230624 -0.234267 -0.239118 0.351200 0.250148 0.238528 0.272225 0.246185 0.246289 0.267976 0.250122 0.250277 0.246972 0.227342 0.223835 0.229355 0.228711 0.230083 0.232849
chargesum: 0.00000
title: Mulliken charges with hydrogens summed into heavy atoms:
elementType: O O N N N N C C C C C C C C C C C C C C C C
charge: -0.266077 -0.267633 -0.163179 -0.054943 -0.219518 -0.060951 0.120533 0.064614 0.188606 0.119263 0.205999 -0.073877 0.149251 0.168959 0.055048 -0.104337 0.488634 -0.170670 -0.167356 -0.001913 -0.004184 -0.006269
polarizability: 3.25260258e+02 2.84196246e+01 1.93707472e+02 -1.51436512e+01 2.59982734e+00 1.42303588e+02
1716.lowfreq: -5.2857 -4.6477 -0.0008 -0.0006 -0.0004 5.7962 13.3136 19.1150 23.2586
frequency: 12.5547 19.0166 23.1414 71.9140 84.4708 91.4001 114.3486 116.1460 129.2789 130.0971 154.4541 184.3609 199.2909 250.9753 272.1694 296.2627 307.3997 321.1438 350.3945 368.0241 378.6163 395.2321 402.3968 414.3405 471.8084 487.0537 501.7807 539.7643 603.3368 615.9948 642.1192 662.2512 688.5583 695.2857 705.0051 708.0918 722.0073 745.1084 766.5864 770.4327 811.9302 846.5769 864.7039 923.4331 927.7515 935.9126 963.3120 978.2801 985.0940 987.0995 989.0581 1001.3026 1027.3204 1040.5462 1067.3113 1089.0879 1106.1625 1130.4656 1132.4856 1167.4845 1174.3404 1189.3159 1192.8452 1208.4617 1224.3211 1227.5822 1255.1414 1264.2211 1297.3609 1301.3321 1313.7533 1343.2267 1373.3423 1380.7341 1387.3070 1417.8034 1428.1653 1440.5177 1446.9260 1463.2373 1474.1857 1479.0720 1479.8158 1481.3789 1486.5248 1523.4222 1577.8509 1585.8074 1612.3818 1615.0544 1658.3556 1664.4234 2980.5858 3006.9655 3012.0503 3040.7386 3075.6219 3096.0911 3103.9880 3104.1776 3118.6932 3127.1027 3137.3486 3138.7757 3139.7007 3150.1927 3167.0997 3573.1596
redmass: 4.0273 5.3603 6.1051 3.9356 3.7176 1.1189 3.5340 4.5193 1.3259 2.8559 3.4652 3.9148 4.1901 4.0451 3.6134 3.3252 4.2040 4.8435 4.1530 5.3810 4.5107 5.6165 2.7721 6.1128 4.7881 5.2959 4.8137 4.9032 4.6664 6.4388 6.5640 5.8157 6.4332 1.9638 8.1945 1.2969 2.5091 10.7995 4.6602 2.0393 2.9204 1.3549 1.9030 1.5061 4.0188 2.2363 3.2913 1.3830 5.7346 1.2018 5.8789 1.2786 2.1723 3.1443 2.5795 1.6639 3.9060 1.3014 1.3008 1.3915 1.0751 2.2396 1.1598 1.8594 2.0639 2.7137 1.6522 5.2216 2.9473 1.5901 1.6334 1.3161 4.4417 4.0945 5.8770 1.3079 1.3205 2.1629 1.3970 1.9536 1.0430 1.0672 1.0450 1.3675 2.2773 4.0637 8.2672 5.7747 6.0072 10.4436 10.3114 6.1161 1.0622 1.0336 1.0327 1.0968 1.0906 1.1025 1.0894 1.1020 1.0876 1.0858 1.1025 1.1011 1.0910 1.0961 1.1015 1.0820
irintensity: 0.0735 0.0628 0.2123 0.1147 0.4962 0.1370 2.7054 2.0430 0.2822 0.2928 1.9058 10.4349 8.9630 2.2566 0.5485 9.3569 6.3508 3.8373 14.1492 6.0508 6.6367 16.7972 0.0134 7.0223 1.2627 25.3710 15.9669 7.6260 1.0742 0.0166 0.4528 3.6228 2.7740 30.3326 22.8979 84.6259 26.7773 8.5219 4.4455 47.7584 2.0270 0.2423 1.3464 1.0785 5.7518 9.2929 52.5060 1.1702 0.5591 49.1989 0.4468 17.8813 3.6498 42.0555 2.7123 5.6830 17.2725 0.3269 0.0902 22.9152 0.6961 11.6863 0.4468 100.5567 3.1657 4.8100 36.9280 21.8634 76.7497 21.8136 7.0793 2.2102 31.3508 35.9929 1.8887 22.6204 73.6939 15.3226 136.3215 126.9698 17.9899 4.8351 16.6761 130.1364 3.2677 34.9013 2.3226 1.8692 11.7084 634.2130 396.6319 8.9863 15.9426 36.8771 29.1355 3.8213 15.6701 17.8909 19.7568 21.2527 11.5871 1.9147 0.7222 0.5782 7.6145 40.8817 24.7691 78.7056
temp: 298.150 k
press: 1.00000 atm
elementType: 8 8 7 7 7 7 6 6 6 6 6 6 6 6 6 6 6 6 6 6 6 6 1 1 1 1 1 1 1 1 1 1 1 1 1 1 1 1
symmnumber: 1
zpe: 779537.1 jmol-1
zpe.correction: 0.296910 hartree
zpe.thermalcorrener: 0.316800 hartree
zpe.thermalcorrenthalpy: 0.317744 hartree
zpe.thermalcorrgfe: 0.245375 hartree
zpe.sumelectzpe: -987.228326 hartree
zpe.sumelectthermal: -987.208437 hartree
zpe.sumelectthermalent: -987.207492 hartree
zpe.sumelectthermalfe: -987.279861 hartree
dipole: 4.5836 -1.8578 -0.2224
dipole: 4.9508
quadrupole: -132.3541 -134.0866 -120.4659
quadrupole: 6.4506 -0.5766 3.3756
quadrupole: -3.3853 -5.1177 8.5030 6.4506 -0.5766 3.3756
hfenergy: -987.5252362 hartree
pointgroup: C01 [X(C16H16N4O2)]
dipole: 1.8319574 -0.4920051 -0.4425106 debye
polarizability: 321.3684015|39.9187459|182.5845613|-0.4467117|23.4884212|157.3183544 unknown
InChI: InChI=1S/C16H16N4O2/c1-19-14-13(15(21)20(2)16(19)22)17-12(18-14)10-6-9-11-7-4-3-5-8-11/h3-9,17H,10H2,1-2H3
charge 0 multiplicity 1
38 atoms
O  -2.076619 2.435403 1.019739
O  -5.874305 -0.317365 0.462506
N  -3.810987 -1.173367 -0.258843
N  -0.494212 0.088423 -0.273395
N  -3.97419 1.030542 0.729003
N  -1.513403 -1.836324 -0.927367
C  -1.851884 0.244173 0.020779
C  -2.44894 -0.955111 -0.396079
C  -0.327987 -1.166541 -0.840051
C  -2.5695 1.335299 0.622034
C  -4.627655 -0.168187 0.316976
C  1.001619 -1.681362 -1.32744
C  -4.41784 -2.441271 -0.707423
C  -4.857261 2.058179 1.326843
C  2.169036 -1.206969 -0.483248
C  3.171908 -0.412072 -0.956349
C  4.347774 0.090262 -0.215806
C  4.582922 -0.191078 1.161024
C  5.294875 0.897297 -0.907115
C  5.722011 0.31732 1.815827
C  6.436695 1.406294 -0.252629
C  6.655675 1.11859 1.113746
H  0.240448 0.772671 -0.088025
H  0.93184 -2.785309 -1.326643
H  1.151311 -1.377254 -2.382804
H  -5.49698 -2.383015 -0.504713
H  -3.972318 -3.289001 -0.160358
H  -4.23942 -2.585077 -1.786215
H  -4.22441 2.917122 1.594063
H  -5.358372 1.653001 2.221054
H  -5.632765 2.358282 0.603362
H  2.171402 -1.547679 0.561768
H  3.121479 -0.106199 -2.013529
H  3.874425 -0.808984 1.723994
H  5.130266 1.12456 -1.9680
H  5.886025 0.091371 2.875422
H  7.152118 2.025124 -0.805239
H  7.539819 1.512152 1.626928
