program: Gaussian 09
title: 000095006
version: EM64L-G09RevD.01
frameworkgroup: C1[X(C14H14N2O4)]
method: RPBEPBE
basis: SDD
operation: Freq
keyword: #p
keyword: freq=noraman
keyword: PBEPBE/SDD
title: #p freq=noraman PBEPBE/SDD
converged: YES YES NO NO
title: Mulliken charges:
elementType: O O O O N N C C C C C C C C C C C C C C H H H H H H H H H H H H H H
charge: -0.242961 -0.270837 -0.202940 -0.202456 -0.144797 -0.224719 -0.361187 -0.369875 -0.498907 -0.302895 -0.290893 0.282076 0.186162 0.185607 0.109152 0.108348 -0.354206 -0.354085 -0.211962 -0.211955 0.266285 0.230418 0.238847 0.235036 0.267761 0.269284 0.226529 0.204885 0.196767 0.224616 0.268546 0.268608 0.237849 0.237900
chargesum: 0.00000
title: Mulliken charges with hydrogens summed into heavy atoms:
elementType: O O O O N N C C C C C C C C C C C C C C
charge: -0.242961 -0.270837 -0.202940 -0.202456 -0.144797 -0.224719 0.135516 0.104008 0.038138 0.128519 0.130490 0.282076 0.186162 0.185607 0.109152 0.108348 -0.085661 -0.085477 0.025887 0.025945
polarizability: 2.44257415e+02 2.41084319e+00 1.65667372e+02 2.53627570e+01 6.82997239e-02 1.18035635e+02
1716.lowfreq: -11.2609 -0.0006 -0.0005 -0.0005 7.7004 8.5651 20.8094 29.1990 37.0538
frequency: 18.4319 29.0969 37.0401 68.8118 95.0972 117.3462 140.4514 144.2688 184.1045 222.0786 234.9302 265.9208 273.8396 313.9307 336.1631 359.1161 392.7990 416.2514 418.0686 450.7823 455.7943 523.3376 530.3261 533.0638 556.2048 595.2060 633.2648 658.2233 683.7546 703.4408 708.3278 775.1830 787.3640 795.0678 802.8574 830.4036 835.2534 887.2868 906.9161 929.9343 945.8035 974.1188 980.7039 1005.9903 1011.7012 1018.0792 1029.3626 1050.9219 1071.3571 1072.5431 1089.3712 1107.2937 1169.1686 1172.9437 1181.6559 1192.5611 1210.9916 1217.4502 1260.3845 1273.8529 1284.1437 1314.4645 1321.6980 1331.2073 1341.3223 1353.9771 1366.4758 1371.3976 1406.8129 1416.9970 1436.0146 1447.4434 1454.0296 1454.5783 1454.6587 1455.7496 1462.9687 1607.1860 1614.8227 1620.6496 1635.1106 1683.9011 2950.1980 2962.3164 2978.3196 2987.3845 3009.2611 3075.3797 3083.4535 3086.6809 3090.4124 3092.1554 3139.0376 3152.9599 3164.9249 3174.5629
redmass: 5.9064 5.0535 5.9379 5.0996 5.9411 7.6261 5.1401 5.3862 7.0388 2.5100 4.6829 2.7448 2.7359 4.4768 8.0182 6.9604 1.8937 4.1335 4.3784 2.8254 4.8847 6.2734 4.6668 3.5734 3.7651 5.4501 3.0117 4.8308 6.9264 5.5327 3.1802 2.7860 5.1953 3.5913 2.4565 1.8462 3.8008 3.0084 1.4032 3.0718 3.3837 1.4149 5.2462 1.3468 2.3499 2.1304 2.4114 2.1501 3.7351 2.5547 2.8357 2.2040 1.1609 2.0232 3.0366 1.0600 3.1656 1.5810 1.5872 1.2018 1.4855 1.3781 1.3495 1.2947 1.2402 1.3320 1.3078 6.9904 2.0470 5.5592 1.3855 1.0819 1.1040 1.9090 2.1021 1.4422 1.1099 8.7014 7.6910 7.7817 12.1212 11.9051 1.0682 1.0680 1.0668 1.0650 1.0582 1.1034 1.0963 1.0959 1.0944 1.0990 1.0864 1.0906 1.0956 1.1003
irintensity: 0.3789 0.0905 2.6918 3.7747 1.0387 5.0356 0.0540 0.5201 1.9921 3.1041 0.3370 1.6763 18.9676 13.1345 5.6872 12.8299 1.1403 7.7936 0.2435 1.7244 0.0548 7.6733 23.4893 1.0738 19.8133 8.7205 15.5312 0.0022 0.1951 1.9721 64.6536 46.5366 0.0604 16.3863 19.8654 0.3627 1.3425 4.0453 0.0313 7.6777 64.4155 2.0392 1.4391 0.0043 14.7175 12.6126 31.4952 35.4738 36.2279 21.7000 29.5214 9.5306 9.5031 5.9269 2.3334 1.3584 14.9737 250.9109 50.3436 11.6879 0.0675 9.2748 10.4933 17.9432 3.5934 2.5118 1.0488 276.6130 50.9013 1.5530 133.6452 6.4596 18.1983 2.8578 10.2547 8.1139 13.6115 290.1669 5.4730 49.9940 402.1400 31.5229 46.1908 45.5713 32.6422 57.1366 28.1365 0.0643 37.3550 11.2547 24.3180 26.2375 1.8312 5.9936 6.3296 22.1099
temp: 298.150 k
press: 1.00000 atm
elementType: 8 8 8 8 7 7 6 6 6 6 6 6 6 6 6 6 6 6 6 6 1 1 1 1 1 1 1 1 1 1 1 1 1 1
symmnumber: 1
zpe: 690655.9 jmol-1
zpe.correction: 0.263057 hartree
zpe.thermalcorrener: 0.280058 hartree
zpe.thermalcorrenthalpy: 0.281002 hartree
zpe.thermalcorrgfe: 0.216243 hartree
zpe.sumelectzpe: -950.861125 hartree
zpe.sumelectthermal: -950.844124 hartree
zpe.sumelectthermalent: -950.843180 hartree
zpe.sumelectthermalfe: -950.907939 hartree
dipole: 0.9986 0.0595 -1.4900
dipole: 1.7947
quadrupole: -92.7591 -124.0160 -112.8386
quadrupole: 3.0866 6.4372 1.0049
quadrupole: 17.1122 -14.1447 -2.9674 3.0866 6.4372 1.0049
hfenergy: -951.124182 hartree
pointgroup: C01 [X(C14H14N2O4)]
dipole: 0.3929982 -0.0364509 -0.5854786 debye
polarizability: 244.2476197|4.970307|165.1863601|25.0130035|-4.7585224|118.5264418 unknown
InChI: InChI=1S/C14H14N2O4/c17-12(15-5-7-20-8-6-15)9-16-13(18)10-3-1-2-4-11(10)14(16)19/h1-4H,5-9H2
charge 0 multiplicity 1
34 atoms
O  -5.714396 0.339228 0.049487
O  -0.967707 0.034055 1.417594
O  0.841109 2.192958 -0.956595
O  1.139232 -2.46006 -0.327645
N  -2.925636 -0.346766 0.216419
N  0.674678 -0.168536 -0.750302
C  -3.759514 -0.303108 1.441363
C  -3.688546 -0.626413 -1.019436
C  -0.747265 -0.29646 -1.011017
C  -4.922047 0.686095 1.246329
C  -4.861611 0.372473 -1.145777
C  -1.552133 -0.188223 0.316016
C  2.738353 0.753343 -0.20779
C  2.828464 -0.648054 -0.019353
C  1.351225 1.083787 -0.665978
C  1.501741 -1.258794 -0.35024
C  3.835402 1.594951 0.027162
C  4.01831 -1.253558 0.410352
C  5.043594 0.992385 0.465115
C  5.133715 -0.410222 0.65377
H  -3.109244 -0.006675 2.281146
H  -4.162826 -1.316103 1.640858
H  -4.094804 -1.657431 -0.971765
H  -3.042022 -0.55236 -1.908128
H  -1.04281 0.510597 -1.705482
H  -0.9252 -1.276553 -1.488989
H  -5.629224 0.637286 2.089888
H  -4.529456 1.720765 1.148573
H  -4.464744 1.399609 -1.301223
H  -5.518996 0.099129 -1.987519
H  3.753619 2.676297 -0.120342
H  4.075202 -2.337014 0.55415
H  5.920614 1.617986 0.662904
H  6.078921 -0.846411 0.994349
