program: Gaussian 09
title: 000094954
version: EM64L-G09RevD.01
frameworkgroup: C1[X(C7H3F4NO2)]
method: RPBEPBE
basis: SDD
operation: Freq
keyword: #p
keyword: freq=noraman
keyword: PBEPBE/SDD
title: #p freq=noraman PBEPBE/SDD
converged: NO YES YES YES
title: Mulliken charges:
elementType: F F F F O O N C C C C C C C H H H
charge: -0.151183 -0.156117 -0.148410 -0.148468 -0.192224 -0.187389 0.022322 0.160967 -0.461170 0.423441 0.257783 0.304591 -0.324079 -0.307113 0.325541 0.301279 0.280228
chargesum: 0.00000
title: Mulliken charges with hydrogens summed into heavy atoms:
elementType: F F F F O O N C C C C C C C
charge: -0.151183 -0.156117 -0.148410 -0.148468 -0.192224 -0.187389 0.022322 0.160967 -0.135629 0.423441 0.257783 0.304591 -0.022800 -0.026884
polarizability: 1.29292413e+02 5.71155319e+00 1.05146884e+02 -6.59080055e-04 1.47690292e-03 4.21488498e+01
1716.lowfreq: -9.3208 -6.6740 -4.5053 0.0008 0.0009 0.0012 37.1964 57.7085 112.5867
frequency: 37.1584 57.6662 112.5866 120.2766 124.8332 207.4583 263.5915 288.3913 297.2553 345.2230 349.6227 429.3581 431.2946 492.3153 492.7729 546.5278 568.7197 614.2279 619.3993 698.9463 709.4226 739.7440 758.0916 848.0541 852.7708 952.0632 987.2949 1004.5591 1011.5336 1031.3275 1092.4556 1119.9034 1206.1228 1210.8041 1247.7070 1269.5673 1373.4481 1405.7831 1431.4612 1476.6155 1595.8268 1625.5222 3180.4433 3191.0265 3197.0075
redmass: 16.6969 15.8011 9.2867 7.4409 15.2148 13.4324 9.2249 12.7131 15.6073 6.3941 13.4912 11.2627 5.5887 12.6930 4.4923 6.2330 6.7547 9.4365 11.6161 6.3394 9.8278 4.5471 8.9583 1.4806 8.5709 1.4721 1.3516 4.7116 8.6965 9.8728 2.5520 1.4457 3.3095 9.2458 1.6145 3.0988 10.8418 10.1154 5.1318 3.2575 7.8933 8.3649 1.0898 1.0928 1.0978
irintensity: 0.7367 0.1585 4.1760 0.8649 2.4119 1.2063 0.1751 1.2164 4.2665 0.0001 0.3773 6.0909 0.0682 3.5912 7.5386 4.6356 0.5258 8.6998 41.5013 21.2659 22.8151 1.7459 0.1778 35.4342 17.8353 77.2343 0.1523 90.4423 209.6079 140.2059 57.3344 35.1500 61.3838 340.1893 11.7167 129.2909 146.8205 1.5820 44.4678 45.4829 57.9643 64.8281 0.6348 13.2290 3.9556
temp: 298.150 k
press: 1.00000 atm
elementType: 9 9 9 9 8 8 7 6 6 6 6 6 6 6 1 1 1
symmnumber: 1
zpe: 248920.0 jmol-1
zpe.correction: 0.094809 hartree
zpe.thermalcorrener: 0.106584 hartree
zpe.thermalcorrenthalpy: 0.107528 hartree
zpe.thermalcorrgfe: 0.055586 hartree
zpe.sumelectzpe: -872.015896 hartree
zpe.sumelectthermal: -872.004120 hartree
zpe.sumelectthermalent: -872.003176 hartree
zpe.sumelectthermalfe: -872.055118 hartree
dipole: -0.2523 3.2673 -0.0002
dipole: 3.2770
quadrupole: -100.1421 -74.1344 -77.6378
quadrupole: -6.6706 -0.0022 -0.0003
quadrupole: -16.1707 9.8370 6.3337 -6.6706 -0.0022 -0.0003
hfenergy: -872.1107042 hartree
pointgroup: C01 [X(C7H3F4N1O2)]
dipole: 0.089301 -1.2861815 -0.0013631 debye
dipolederiv: -0.8857822 -0.3899159 -0.0000015 -0.3804728 -0.3993114 -0.0000939 0.0000108 -0.0000791 -0.1155456 -0.4045858 0.030572 0.0001229 0.0103992 -0.7712091 -0.0002051 0.0001339 -0.0002942 -0.2844122 -0.6618187 0.0659873 -0.2585705 0.0586912 -0.3021575 -0.0640529 -0.2567671 -0.0532728 -0.6250143 -0.6610975 0.0658477 0.2586301 0.0585672 -0.3023709 0.0643617 0.2570088 0.0535231 -0.6257398 -0.8268395 0.1237649 0.0003264 0.0758817 -0.508316 -0.0002354 0.0003911 -0.0003435 -0.2181631 -0.5331168 -0.117033 0.0000446 -0.1004358 -0.7742023 -0.0004823 0.0000484 -0.0003609 -0.213491 1.5955115 0.2210913 -0.0003943 0.271675 1.1733462 0.0006971 -0.0003366 0.0007579 0.1926388 -0.4110206 0.0536961 0.0001371 -0.0918636 -0.3673684 -0.0001289 -0.0001158 -0.0001248 -0.1796066 0.264975 0.0443386 -0.0000955 -0.0086762 -0.0637377 -0.0000028 -0.0001316 -0.0000628 -0.0474465 -0.4826671 -0.1575825 0.0001153 -0.2128493 -0.2046535 -0.0001283 0.0000056 -0.0001915 0.0585951 1.1111663 0.4505851 -0.0000249 0.2967269 0.5915273 0.000265 -0.0001765 0.000194 0.1535922 1.9002093 -0.3119554 -0.000374 -0.3255732 1.4546254 0.0000211 -0.0005157 0.0000853 1.5843261 0.1374814 0.0194295 -0.0000627 0.2324005 0.1445992 0.0001069 0.0000887 0.0001875 -0.0764824 -0.490161 -0.1166164 0.0000563 0.1083811 0.0695337 0.00014 0.0002668 0.0002309 -0.1298514 0.1691198 -0.0192283 -0.0000206 0.0065918 0.1188995 -0.0000585 -0.0000018 -0.0000393 0.1730157 0.0903157 0.0507656 0.0000815 0.0175553 0.1250772 -0.0000563 0.0000566 -0.0000678 0.1732828 0.0883103 -0.0137466 0.0000299 -0.0169989 0.0157182 -0.0001475 0.0000344 -0.0001421 0.1803022 unknown
polarizability: 129.3795172|5.5236749|105.0597103|-0.035764|0.055873|42.1489185 unknown
InChI: InChI=1S/C7H3F4NO2/c8-6-2-1-4(12(13)14)3-5(6)7(9,10)11/h1-3H
charge 0 multiplicity 1
17 atoms
F  -2.098698 -2.036079 -0.000892
F  -1.876176 2.216873 0.002467
F  -2.925263 0.557085 -1.131378
F  -2.923393 0.555876 1.136288
O  3.956547 -0.146691 -0.001856
O  2.900566 1.878073 0.000319
N  2.896607 0.58871 -0.000601
C  -0.841971 0.032697 0.000444
C  0.408225 0.68023 0.000535
C  1.580533 -0.100816 -0.000705
C  -0.868528 -1.383013 -0.000869
C  -2.122894 0.827457 0.001879
C  1.549124 -1.512166 -0.002043
C  0.301025 -2.161687 -0.002141
H  0.480803 1.770467 0.00155
H  2.48782 -2.071486 -0.002966
H  0.219772 -3.251529 -0.00313
