program: Gaussian 09
title: 000094957
version: EM64L-G09RevD.01
frameworkgroup: C1[X(C11H11FN2O)]
method: RPBEPBE
basis: SDD
operation: Freq
keyword: #p
keyword: freq=noraman
keyword: PBEPBE/SDD
title: #p freq=noraman PBEPBE/SDD
converged: YES YES NO NO
title: Mulliken charges:
elementType: F O N N C C C C C C C C C C C H H H H H H H H H H H
charge: -0.207522 -0.258773 -0.278872 -0.134225 0.439438 0.451941 0.178254 -0.525087 -0.654276 -0.778486 -0.330803 -0.344405 -0.359351 -0.361003 0.316446 0.278183 0.270194 0.244109 0.246479 0.243312 0.243043 0.254341 0.290819 0.263136 0.257401 0.255709
chargesum: 0.00000
title: Mulliken charges with hydrogens summed into heavy atoms:
elementType: F O N N C C C C C C C C C C C
charge: -0.207522 -0.258773 -0.278872 -0.134225 0.439438 0.451941 0.178254 -0.246904 0.106505 -0.037790 -0.039985 -0.081268 -0.101950 -0.105293 0.316446
polarizability: 1.95882991e+02 -4.02238276e-01 1.41116090e+02 -4.34042578e+00 7.77280106e+00 7.75550750e+01
1716.lowfreq: -6.4316 0.0001 0.0002 0.0006 2.7758 5.4005 53.5361 66.2631 86.0647
frequency: 53.5221 66.2532 86.0556 138.3595 154.3284 173.8851 179.5207 200.3144 250.4518 277.7024 296.7550 345.3374 361.9013 390.3813 416.0612 435.8282 504.7848 553.7095 575.1275 596.5097 600.6727 627.8406 657.9750 691.1780 708.1154 789.4034 801.4280 807.3042 826.8994 839.4048 934.1939 947.2301 975.3212 990.2008 1004.7502 1029.5686 1047.3724 1091.9948 1108.9755 1131.8120 1155.7648 1168.1641 1195.7738 1205.4084 1212.7420 1292.0256 1326.8424 1372.5197 1387.1798 1406.2509 1413.9532 1438.1709 1458.4514 1470.3199 1479.5356 1494.0631 1496.4198 1592.3936 1599.3188 1613.0033 1646.1619 2973.5899 2982.9313 3060.8920 3083.9138 3110.0162 3124.1042 3153.1582 3172.1670 3176.7817 3199.3169 3245.8644
redmass: 4.4646 5.2425 4.9080 1.8339 1.4432 1.8986 3.3640 2.0050 6.0985 3.8010 3.1950 6.4367 5.2373 5.5693 3.1109 5.2941 2.8395 5.1493 5.0574 4.4941 5.5845 6.4773 4.8800 3.8895 4.0990 6.0831 1.4355 1.2659 1.8400 3.0405 1.3182 1.3483 5.2417 1.6673 2.4565 2.5332 1.5497 2.1355 1.3040 1.7207 1.4282 1.7405 2.0966 7.0499 2.2918 1.2924 5.6012 4.8325 3.5017 1.3616 3.5386 1.1857 1.0593 1.0607 1.1210 1.9958 1.2980 7.2681 7.4720 6.5016 10.4420 1.0428 1.0394 1.0970 1.0909 1.0975 1.1012 1.0886 1.0907 1.0966 1.0964 1.0990
irintensity: 2.0764 1.2619 2.1229 2.3089 1.2848 0.8457 2.0143 1.1683 0.2773 13.5850 4.0900 1.6575 2.1699 3.1281 0.6571 9.4049 21.7526 19.5283 11.1646 16.4211 10.5229 1.2609 4.7054 1.4376 0.5105 35.9952 47.5096 1.6187 61.2745 27.1586 0.4305 2.7171 9.4729 0.7839 11.3021 27.5900 8.9493 13.4126 15.0406 59.0959 38.2032 8.9078 47.6643 15.1198 18.4625 8.1110 108.2495 31.9750 33.1365 26.0070 1.4325 22.7210 32.6994 13.4217 10.2776 239.8256 51.7175 0.0748 11.2339 18.3409 363.6101 55.7082 24.2510 15.2559 13.6329 13.0184 9.3922 6.3814 3.2197 2.5738 0.5852 0.4808
temp: 298.150 k
press: 1.00000 atm
elementType: 9 8 7 7 6 6 6 6 6 6 6 6 6 6 6 1 1 1 1 1 1 1 1 1 1 1
symmnumber: 1
zpe: 522622.3 jmol-1
zpe.correction: 0.199056 hartree
zpe.thermalcorrener: 0.212607 hartree
zpe.thermalcorrenthalpy: 0.213551 hartree
zpe.thermalcorrgfe: 0.158884 hartree
zpe.sumelectzpe: -709.234633 hartree
zpe.sumelectthermal: -709.221083 hartree
zpe.sumelectthermalent: -709.220139 hartree
zpe.sumelectthermalfe: -709.274805 hartree
dipole: 4.2639 -5.3777 1.2022
dipole: 6.9675
quadrupole: -83.1987 -90.3968 -86.6382
quadrupole: -9.2980 -0.7821 2.5619
quadrupole: 3.5459 -3.6522 0.1063 -9.2980 -0.7821 2.5619
hfenergy: -709.4336896 hartree
pointgroup: C01 [X(C11H11F1N2O1)]
dipole: -1.6170108 -2.1477774 -0.5353654 debye
dipolederiv: -1.2965083 0.1045284 -0.0367845 0.1151428 -0.2045147 0.0292666 -0.0454915 0.0201738 -0.161183 -0.5032826 -0.4198495 -0.0631966 0.0377369 -1.2348 -0.1409114 0.0384442 -0.0833825 -0.3584775 -1.1574953 0.3804556 0.1412969 0.437324 -0.3823928 -0.0714871 0.4005516 -0.2714301 -0.2680205 -0.3890975 0.5618367 0.1503162 0.4424679 -0.7642283 -0.1939973 -0.189611 0.1655069 -0.1080971 0.4512194 -0.2891392 -0.1750684 -0.1224889 0.7966969 0.111635 -0.0810001 0.057196 -0.0084121 1.2685932 -0.20237 0.0355753 -0.0968802 -0.088344 -0.0387753 -0.0692426 0.0659481 0.0787349 0.9357164 0.5148682 -0.0400052 -0.3517681 1.5405996 0.2195416 -0.143851 0.1186574 0.242104 -0.4064554 -0.4740851 -0.0842272 -0.1396215 -0.5746936 -0.0532917 -0.0988774 0.0406247 -0.2523271 0.0681418 -0.1182482 -0.0480075 -0.0927879 0.398551 0.1660128 0.0769894 0.0411747 0.3725897 -0.085949 -0.0521074 0.0251244 -0.1300108 -0.0221166 0.003066 -0.0225182 -0.0008234 0.0830791 -0.1621101 0.0515401 -0.0238942 -0.2128997 0.0537092 -0.0792747 -0.0193225 -0.0275183 -0.1080876 -0.102929 -0.0311629 0.0335692 0.180677 -0.0632107 -0.0673899 -0.0358179 -0.0945886 -0.1082304 -0.0971684 0.0073593 0.0043675 0.1631996 -0.0195619 -0.0637695 -0.0836061 -0.0466201 -0.1166962 -0.1859127 0.054748 -0.0237568 -0.153678 -0.0144962 -0.0687012 0.0998115 -0.076335 -0.1171373 1.3045941 -0.1070909 0.0423081 -0.0833288 0.1772351 -0.0529336 0.0188159 -0.0385853 0.0949946 0.0102911 0.0389976 0.0482974 0.0307066 0.0826495 -0.0311178 0.0906108 -0.0187985 0.1813229 -0.0446172 0.1263087 0.040534 0.0791387 0.1057395 0.0021574 0.0006678 0.0147822 0.0742015 0.064906 0.0103838 -0.0525199 0.0523729 -0.0004435 0.0702426 -0.0274578 -0.1043959 -0.1693518 0.0291187 -0.1396906 0.009383 -0.1017054 -0.0102328 0.0111153 0.0362288 0.0328092 0.0555141 0.0452857 0.0386202 -0.0468767 -0.0321145 -0.0544996 0.0972796 0.0023298 0.1067065 0.0503897 0.0426622 -0.0425067 -0.0095464 -0.0784987 0.0506557 -0.0525609 -0.0715897 -0.079919 -0.0782681 -0.0263176 0.0335883 0.0541475 0.1117594 0.043168 -0.0577693 0.0835007 -0.0284004 0.0926433 0.1127648 0.0490845 -0.0274864 0.0272991 0.0650661 0.0551254 -0.0306496 0.022529 0.1315153 0.0426937 -0.0876236 0.0385698 -0.0785744 0.046445 0.0589499 0.0619651 0.052224 0.115479 0.0270488 -0.0537066 0.0321678 -0.0657751 0.0510198 0.0651472 0.0436204 0.0576174 0.1454759 0.054807 0.0452612 -0.0242873 0.0623072 0.0219993 0.0824402 -0.0345006 0.0748473 0.1362445 unknown
polarizability: 195.6933761|2.2009253|141.6999685|-5.4098037|-5.5105511|77.1608114 unknown
InChI: InChI=1S/C11H11FN2O/c1-8-7-11(15)14(13(8)2)10-5-3-9(12)4-6-10/h3-7H,1-2H3
charge 0 multiplicity 1
26 atoms
F  4.768399 -0.353716 0.135987
O  -1.009349 2.600222 0.285452
N  -0.821086 0.246958 -0.164167
N  -1.699942 -0.881739 -0.075232
C  -2.976149 -0.372183 0.244635
C  0.591409 0.072366 -0.084677
C  -1.544292 1.457098 0.200628
C  -2.905908 0.993222 0.449583
C  -1.531608 -1.933811 -1.104465
C  -4.168237 -1.284405 0.305305
C  1.43448 1.089218 -0.606831
C  1.156741 -1.076092 0.530599
C  2.834804 0.951781 -0.522357
C  2.557704 -1.226988 0.59704
C  3.366899 -0.208056 0.067051
H  -3.713211 1.646318 0.769669
H  -0.490453 -2.29031 -1.108068
H  -1.78624 -1.561397 -2.11642
H  -2.187913 -2.779949 -0.847515
H  -3.976754 -2.160124 0.951934
H  -4.457736 -1.659152 -0.694928
H  -5.030293 -0.736436 0.716615
H  0.988223 1.982206 -1.048213
H  0.503371 -1.825604 0.987793
H  3.502879 1.725771 -0.910395
H  3.014661 -2.102598 1.066878
