program: Gaussian 09
title: 000095000
version: EM64L-G09RevD.01
frameworkgroup: C1[X(C22H26N2)]
method: RPBEPBE
basis: SDD
operation: Freq
keyword: #pfreq=noraman
keyword: PBEPBE/SDD
title: #p freq=noraman PBEPBE/SDD
converged: NO YES NO NO
title: Mulliken charges:
elementType: N N C C C C C C C C C C C C C C C C C C C C C C H H H H H H H H H H H H H H H H H H H H H H H H H H
charge: -0.076875 -0.022634 -0.074778 -0.490992 -0.346180 -0.362701 -0.404542 -0.392636 0.107807 -0.399559 -0.741761 0.381134 0.372035 -0.255251 -0.346667 -0.400370 -0.404131 -0.381508 -0.239858 -0.233764 -0.240767 -0.243608 -0.241836 -0.244259 0.233796 0.224413 0.220796 0.163700 0.214075 0.218605 0.152522 0.189724 0.205509 0.205664 0.188526 0.213779 0.185433 0.200919 0.244737 0.235003 0.251017 0.258120 0.253538 0.245452 0.229146 0.230464 0.227060 0.229074 0.231428 0.231199
chargesum: 0.00000
title: Mulliken charges with hydrogens summed into heavy atoms:
elementType: N N C C C C C C C C C C C C C C C C C C C C C C
charge: -0.076875 -0.022634 0.159018 -0.045784 0.031595 0.008426 -0.009310 0.001555 0.107807 -0.000346 -0.061102 0.381134 0.372035 -0.255251 -0.095650 -0.142249 -0.150593 -0.136056 -0.010712 -0.003300 -0.013707 -0.014534 -0.010408 -0.013060
polarizability: 2.38980596e+02 1.27860298e-01 2.51434140e+02 1.03285417e+00 9.06214601e+00 2.16757180e+02
1716.lowfreq: -0.0006 -0.0004 -0.0002 2.0308 4.3688 8.7936 18.6200 30.5726 43.6923
frequency: 16.3784 27.7215 43.6830 44.7116 52.5306 66.3417 82.2183 101.5131 116.5397 136.5243 161.4357 192.0890 214.8498 223.4637 226.8928 236.7565 264.7485 276.6656 300.3624 316.4159 354.2473 377.2558 398.4942 399.7191 404.8819 432.5835 446.2750 453.4158 461.5779 500.5488 501.6227 541.3929 568.3176 615.4755 616.7953 633.4135 652.0045 698.6984 702.9438 708.3749 728.6448 763.4016 775.3475 808.0542 830.9142 842.7641 851.9751 852.9237 857.8129 858.7736 905.5005 914.0281 920.3703 933.2222 956.7034 958.8720 975.6413 980.0472 982.4386 991.1052 991.5426 997.5185 998.8028 1022.6745 1027.8595 1030.4120 1041.0526 1051.3704 1075.3576 1087.7112 1095.4527 1098.1706 1117.8368 1124.0154 1128.7533 1150.0065 1156.1782 1171.7643 1173.9259 1174.7472 1180.1309 1196.0474 1198.4074 1220.3748 1259.8149 1260.4724 1267.9954 1297.5178 1310.7784 1322.7221 1323.9907 1331.3420 1335.1141 1340.1441 1343.4202 1347.8594 1371.0395 1377.7832 1381.1226 1381.7270 1393.7581 1433.9964 1436.6267 1451.5263 1456.6741 1461.5173 1465.2365 1466.2833 1474.3405 1475.9432 1481.3362 1483.1934 1486.7418 1590.5548 1593.4883 1608.2039 1611.4635 2178.4678 2798.7241 2822.1275 2963.3356 2983.3363 2984.6176 2985.0960 2990.0050 3003.7259 3022.2742 3032.1715 3043.0416 3046.2067 3048.3498 3054.5228 3083.6339 3102.5553 3122.8218 3124.9499 3128.4818 3131.6123 3139.4001 3144.8333 3148.9865 3159.4978 3165.1498 3170.6987
redmass: 3.8125 3.7695 4.1262 4.0416 3.5717 4.2100 3.5617 4.7572 5.8255 5.7749 3.2568 2.7075 1.9556 2.1065 3.1417 2.8708 2.0876 2.7646 4.2108 3.1086 2.8032 2.2158 3.9891 3.1475 2.8696 3.1033 2.9089 3.0290 5.5084 2.2432 3.3770 3.8715 2.4874 6.3813 6.3825 5.8843 4.7035 4.2275 1.7155 1.7322 2.8595 1.9296 2.0407 1.4690 2.7276 2.3145 1.3522 2.0185 1.3171 1.7023 2.2024 1.8487 1.4730 1.5665 2.2439 1.3275 2.1885 1.5957 1.4460 5.7317 5.7964 1.3352 1.3466 2.4138 2.2680 2.2403 2.8462 1.8659 1.6809 1.5961 1.8750 2.0727 2.1787 2.4307 2.2843 1.2595 2.5115 3.1061 1.0764 1.0598 2.3486 1.1182 1.1337 2.0788 1.3902 1.2698 1.2003 1.4617 1.3324 1.3591 1.3179 1.2861 1.3208 1.3575 1.4741 1.4426 1.3976 5.2746 2.9202 1.8881 1.2651 2.2030 2.2344 1.0933 1.0987 1.0878 1.0836 1.0978 1.0721 1.0745 2.1461 2.0279 1.0697 6.0279 6.1337 5.9767 5.9781 12.6612 1.0708 1.0701 1.0631 1.0583 1.0618 1.0606 1.0393 1.0816 1.0872 1.0954 1.0905 1.1004 1.1022 1.1030 1.0972 1.0993 1.0853 1.0853 1.0872 1.0882 1.0918 1.0934 1.0961 1.0961 1.1015 1.0986
irintensity: 0.0945 0.0757 0.1990 0.1668 0.0421 0.2490 0.6671 0.7312 2.3663 2.1641 1.6986 0.1535 0.0244 0.8489 0.8943 0.6467 0.6488 1.8854 0.1303 1.3418 0.5609 1.8079 0.7554 0.3321 0.4373 0.7455 6.8020 0.2526 1.5589 1.4293 8.3270 8.7438 2.7209 0.0677 0.1557 6.9004 16.2674 0.7469 50.2907 76.6723 3.5024 42.2722 26.2039 0.0783 4.2721 3.3639 0.9194 1.7172 0.8334 6.7073 3.2392 1.1550 2.2185 4.5238 9.0084 1.8076 4.5806 2.2507 0.2900 1.6912 1.6603 0.2600 0.2370 8.1537 9.4962 4.0258 7.4459 5.0496 3.5480 3.9869 0.8795 29.3269 22.0222 11.8520 15.1783 6.9273 22.2038 3.6430 0.7093 0.1707 13.0416 2.0044 3.8791 15.7973 5.4515 2.7085 3.1526 6.2826 15.5509 4.9378 1.2622 5.1236 2.2060 2.3508 3.5390 2.0981 3.9132 2.3410 1.7712 1.7004 27.5984 11.8887 8.6348 6.0202 6.5497 15.1489 2.5249 12.7671 19.6995 3.1206 26.5197 9.3522 11.0357 2.7499 0.0993 8.5163 4.0396 10.0655 72.0666 115.5598 35.5804 20.8447 32.8059 48.3077 14.7324 7.5318 50.7759 67.9432 30.7293 3.7246 27.1398 93.4644 34.1886 21.6000 3.3737 2.1774 0.2991 1.7832 10.8397 22.0868 25.9237 34.1311 23.9892 12.1916
temp: 298.150 k
press: 1.00000 atm
elementType: 7 7 6 6 6 6 6 6 6 6 6 6 6 6 6 6 6 6 6 6 6 6 6 6 1 1 1 1 1 1 1 1 1 1 1 1 1 1 1 1 1 1 1 1 1 1 1 1 1 1
symmnumber: 1
zpe: 1112352.9 jmol-1
zpe.correction: 0.423673 hartree
zpe.thermalcorrener: 0.445972 hartree
zpe.thermalcorrenthalpy: 0.446916 hartree
zpe.thermalcorrgfe: 0.370722 hartree
zpe.sumelectzpe: -961.655044 hartree
zpe.sumelectthermal: -961.632745 hartree
zpe.sumelectthermalent: -961.631800 hartree
zpe.sumelectthermalfe: -961.707995 hartree
dipole: 0.7332 -0.1794 -4.2027
dipole: 4.2700
quadrupole: -142.6638 -130.4857 -154.8271
quadrupole: -2.5825 8.2973 2.2257
quadrupole: -0.0049 12.1732 -12.1682 -2.5825 8.2973 2.2257
hfenergy: -962.0787167 hartree
pointgroup: C01 [X(C22H26N2)]
dipole: 0.2771336 -0.1120516 -1.6531199 debye
polarizability: 239.1483242|-1.382597|252.0545052|-0.3194169|7.4454773|215.9690869 unknown
InChI: InChI=1S/C22H26N2/c1-19(24-15-9-4-10-16-24)17-22(18-23,20-11-5-2-6-12-20)21-13-7-3-8-14-21/h2-3,5-8,11-14,19H,4,9-10,15-17H2,1H3
charge 0 multiplicity 1
50 atoms
N  2.930545 0.304621 0.359101
N  -1.696471 -0.135545 3.265391
C  1.611141 0.467507 1.04433
C  0.574664 -0.615897 0.591435
C  3.607236 -1.00021 0.556517
C  2.933022 0.714969 -1.064983
C  5.07545 -0.927262 0.083463
C  4.377978 0.842529 -1.592406
C  -0.953463 -0.242892 0.6939
C  5.150083 -0.48267 -1.395269
C  1.799987 0.521679 2.575695
C  -1.862755 -1.348523 0.061818
C  -1.205089 1.116853 -0.012139
C  -1.354725 -0.167796 2.122492
C  -3.252314 -1.088792 -0.066682
C  -1.509507 2.299594 0.702748
C  -1.364294 -2.60334 -0.361781
C  -1.082724 1.181053 -1.424171
C  -4.121373 -2.055794 -0.610428
C  -1.685248 3.52628 0.020523
C  -2.234709 -3.573368 -0.913198
C  -1.253717 2.404424 -2.104633
C  -3.614633 -3.305498 -1.039554
C  -1.555091 3.584933 -1.384223
H  1.237802 1.457544 0.717394
H  0.75934 -0.842761 -0.476624
H  0.748643 -1.547277 1.162794
H  3.096695 -1.825053 -0.009119
H  3.572178 -1.264327 1.628183
H  2.406099 1.683871 -1.149938
H  2.384711 -0.016477 -1.719965
H  5.556863 -1.915378 0.219198
H  5.615612 -0.197786 0.717119
H  4.887242 1.653896 -1.037646
H  4.356139 1.126482 -2.662632
H  6.203342 -0.369804 -1.715001
H  4.70007 -1.268836 -2.037605
H  2.062722 -0.465895 2.998239
H  0.879516 0.855621 3.082584
H  2.611059 1.230345 2.816279
H  -3.651747 -0.121603 0.260104
H  -1.615326 2.267074 1.793032
H  -0.301564 -2.842835 -0.267598
H  -0.870214 0.268303 -1.99312
H  -5.191138 -1.83662 -0.698849
H  -1.923504 4.432136 0.588937
H  -1.831164 -4.539029 -1.238004
H  -1.158884 2.436979 -3.195789
H  -4.287736 -4.059033 -1.463132
H  -1.691848 4.534711 -1.912888
