program: Gaussian 09
title: 000094944
version: EM64L-G09RevD.01
frameworkgroup: C1[X(C8H13BrO4)]
method: RPBEPBE
basis: SDD
operation: Freq
keyword: #p
keyword: freq=noraman
keyword: PBEPBE/SDD
title: #p freq=noraman PBEPBE/SDD
converged: YES YES NO NO
title: Mulliken charges:
elementType: Br O O O O C C C C C C C C H H H H H H H H H H H H H
charge: 0.055932 -0.251353 -0.274860 -0.211415 -0.190420 -0.433876 -0.661208 0.334361 0.356603 -0.223390 -0.217029 -0.672702 -0.673688 0.268810 0.247850 0.244011 0.236640 0.233704 0.239956 0.231484 0.215684 0.229765 0.236465 0.215263 0.227215 0.236201
chargesum: 0.00000
title: Mulliken charges with hydrogens summed into heavy atoms:
elementType: Br O O O O C C C C C C C C
charge: 0.055932 -0.251353 -0.274860 -0.211415 -0.190420 -0.433876 0.099462 0.334361 0.356603 0.246954 0.254411 0.009212 0.004991
polarizability: 1.27544970e+02 -6.06492248e+00 1.28419736e+02 2.73441029e+00 5.50417304e+00 9.25256019e+01
1716.lowfreq: -10.4645 -4.7575 -0.0008 -0.0006 -0.0005 1.7366 14.9174 31.0701 56.2616
frequency: 13.4013 30.8193 56.2260 62.5529 79.7223 98.4556 108.2856 134.4979 171.2322 189.0460 213.1121 250.1745 254.1302 259.3137 274.3885 281.2312 291.9172 335.3047 368.9438 410.8279 479.2400 615.5835 654.9887 711.9679 745.3995 796.1436 798.9492 800.2600 812.8291 861.9510 911.0115 1020.0391 1020.7335 1055.3008 1071.5719 1095.7540 1112.5803 1113.7378 1135.0812 1135.7970 1174.3063 1213.1076 1250.9893 1251.9033 1354.8791 1356.5258 1393.3548 1400.7171 1401.7105 1462.4281 1463.5033 1463.9029 1465.3709 1472.1637 1473.7149 1485.3653 1485.8633 1619.8000 1662.6358 2996.8447 2997.3509 3005.8959 3013.5667 3015.1013 3073.7658 3075.2948 3093.4377 3094.0510 3103.1278 3109.9853 3110.2319 3135.1274
redmass: 3.1853 3.1787 4.3423 3.6438 2.8676 4.5694 4.2226 3.0509 3.6727 3.5857 2.7409 1.4725 1.6569 1.3334 1.9982 3.0030 5.1844 4.8103 3.5444 4.6083 6.5550 6.3855 6.2944 6.6821 6.1180 4.4025 1.1051 1.1207 3.8958 4.2424 2.9968 2.2471 2.2104 2.1268 3.4007 4.6767 2.2662 2.2422 1.4578 1.4667 5.1278 3.6992 1.1370 1.1331 1.3677 1.3435 1.1803 1.2609 1.2639 1.0499 1.0405 1.0431 1.0482 1.0636 1.0633 1.0662 1.0665 11.7371 12.1220 1.0359 1.0359 1.0355 1.0581 1.0582 1.1068 1.1065 1.0985 1.0985 1.1000 1.1032 1.1030 1.1004
irintensity: 0.3656 0.2255 0.7885 0.8123 3.1026 0.1933 0.8556 2.6839 1.1941 4.1679 1.3408 1.2998 1.8490 0.6756 0.8841 1.8498 9.5506 18.0013 2.5640 1.9747 15.1929 22.2923 6.9543 0.2647 6.9700 10.3776 3.7973 4.1272 16.1330 12.8743 5.7805 72.6663 21.1214 137.4545 370.9654 146.8781 7.9347 3.4213 6.7963 8.8427 135.4846 151.8191 0.1202 0.2364 1.3577 2.6103 14.5529 26.0836 25.7415 28.8558 11.4999 5.3577 15.3687 3.7527 6.5418 14.3861 14.6009 178.3887 155.8055 17.8626 17.9969 7.0689 15.0403 16.6740 5.0043 3.8229 27.9304 26.8043 9.3649 41.7531 37.3080 7.4677
temp: 298.150 k
press: 1.00000 atm
elementType: 35 8 8 8 8 6 6 6 6 6 6 6 6 1 1 1 1 1 1 1 1 1 1 1 1 1
symmnumber: 1
zpe: 529398.5 jmol-1
zpe.correction: 0.201637 hartree
zpe.thermalcorrener: 0.217849 hartree
zpe.thermalcorrenthalpy: 0.218794 hartree
zpe.thermalcorrgfe: 0.154822 hartree
zpe.sumelectzpe: -625.970800 hartree
zpe.sumelectthermal: -625.954588 hartree
zpe.sumelectthermalent: -625.953644 hartree
zpe.sumelectthermalfe: -626.017616 hartree
dipole: 0.3633 4.0105 2.4613
dipole: 4.7195
quadrupole: -69.2208 -86.0824 -88.8026
quadrupole: -0.6905 -3.2729 -1.8560
quadrupole: 12.1478 -4.7138 -7.4340 -0.6905 -3.2729 -1.8560
hfenergy: -626.1724377 hartree
pointgroup: C01 [X(C8H13Br1O4)]
dipole: 0.4372759 -1.5185856 -0.9748977 debye
dipolederiv: -0.1317313 -0.101371 -0.0698564 -0.0575588 -0.4849018 -0.0851108 -0.0609861 -0.0515931 -0.1423798 -1.4857841 0.54278 0.2223723 0.5240888 -0.5171172 0.0163985 0.2162107 -0.0038982 -0.4877262 -1.024324 -0.647389 0.0314609 -0.5998545 -1.2004143 -0.1305303 0.077433 -0.0972929 -0.3037584 -0.6626991 0.1618151 0.025309 0.0030151 -0.4179011 0.2393975 0.3405964 0.1735639 -0.7476804 -0.6686361 0.2199322 0.191635 -0.0682813 -0.715187 -0.130853 0.1058364 -0.2440422 -0.3571531 -0.0898381 0.2351708 0.1197536 0.3448464 0.5379298 0.2207303 0.1674436 0.3005873 0.1575313 -0.09658 -0.054279 0.0015098 -0.0475432 -0.1163108 -0.0961094 -0.0158938 -0.0429261 -0.0834275 1.4253428 -0.6878535 -0.2774185 -0.446382 0.6034146 -0.3171543 -0.6209981 -0.2448977 0.8864606 1.2430231 0.2347946 -0.2335595 0.3331521 1.2916247 0.2993958 -0.2108614 0.3579977 0.3021528 0.8064805 -0.2510973 0.0317419 -0.2978446 0.4846796 0.0209957 0.1715372 -0.0444165 0.2536102 0.7443098 0.4088227 0.0052107 0.2803587 0.503789 -0.0511343 -0.0701444 -0.1172582 0.3062821 -0.1169951 0.050054 0.0670029 0.0563182 0.0338005 -0.010487 0.0513872 -0.0002187 0.0197156 -0.0124125 -0.0821436 -0.0102563 -0.0700855 -0.1155564 -0.0313251 0.0044538 -0.0227197 0.054199 -0.0437406 -0.0362387 0.0706176 -0.0277417 0.1243627 0.0015934 0.0814466 -0.0082117 0.0806689 0.118905 -0.0422872 -0.0095561 -0.0553023 -0.0478743 -0.045278 -0.0378381 -0.075892 0.0552563 0.0340657 0.0989351 -0.0710983 0.0929491 0.0261626 0.078566 -0.0681566 0.0390176 0.0341705 -0.0142241 0.0481714 -0.0007571 0.0379506 -0.0107667 -0.0971921 -0.0759773 -0.0379712 -0.0683958 -0.0621696 -0.0627055 0.0325566 0.0045418 -0.0901962 0.0417509 -0.0327534 0.0531593 0.0591125 -0.0043449 -0.0801818 -0.024708 -0.0302812 0.0297008 -0.0423086 0.0438169 0.0000786 -0.1037207 -0.0895196 -0.0224699 -0.0304704 0.0699035 -0.0564958 0.0527193 -0.0370289 0.0738524 0.0406675 -0.0534675 0.106223 -0.0532609 0.1137766 0.0348468 0.0608143 -0.0720174 0.0688216 0.0405456 0.0825391 -0.0479858 -0.0636034 -0.0429286 0.060145 -0.0872535 -0.000598 -0.1027317 -0.0791982 0.0777517 -0.0594184 0.0236798 -0.1097553 -0.0830955 0.0474223 0.0555594 0.017629 0.0794292 -0.1117343 -0.095665 0.0649511 -0.0840161 0.0403275 0.0050883 0.0718317 0.0134231 0.0893275 0.123931 0.0295861 0.0257895 -0.0022027 0.0751679 0.0032676 -0.0054298 -0.0448521 -0.1400968 0.0118522 0.1348009 -0.069046 0.0788768 0.0098658 0.0365966 -0.0788694 0.0407914 0.0544072 unknown
polarizability: 125.2218228|5.4931403|130.6634238|-3.9839454|4.9102938|92.6050615 unknown
InChI: InChI=1S/C8H13BrO4/c1-4-12-6(10)8(3,9)7(11)13-5-2/h4-5H2,1-3H3
charge 0 multiplicity 1
26 atoms
Br 0.63226 2.834122 0.051089
O  2.115055 -0.248856 -0.279411
O  -1.832166 -0.53107 -0.278261
O  0.658888 -0.42374 1.530998
O  -2.177831 1.597156 0.607349
C  0.019204 0.944636 -0.431777
C  0.136674 0.769831 -1.95504
C  0.935481 0.018106 0.394298
C  -1.442669 0.763668 0.051396
C  3.122604 -1.071501 0.468688
C  -3.201066 -0.9391 0.177859
C  4.341688 -1.201359 -0.436262
C  -3.401119 -2.381924 -0.269888
H  1.177989 0.917002 -2.276665
H  -0.184649 -0.25095 -2.22746
H  -0.511068 1.497851 -2.471199
H  3.346125 -0.551453 1.41751
H  2.658464 -2.045451 0.706551
H  -3.237052 -0.823831 1.275725
H  -3.933287 -0.244514 -0.271658
H  5.118722 -1.800532 0.072301
H  4.081029 -1.704095 -1.383246
H  4.76587 -0.210446 -0.671083
H  -4.397778 -2.735073 0.05184
H  -3.340769 -2.469445 -1.368274
H  -2.6382 -3.041332 0.177319
