program: Gaussian 09
title: 000094930
version: EM64L-G09RevD.01
frameworkgroup: C1[X(C10H14N4O3)]
method: RPBEPBE
basis: SDD
operation: Freq
keyword: #p
keyword: freq=noraman
keyword: PBEPBE/SDD
title: #p freq=noraman PBEPBE/SDD
converged: YES YES NO NO
title: Mulliken charges:
elementType: O O O N N N N C C C C C C C C C C H H H H H H H H H H H H H H
charge: -0.256456 -0.274735 -0.272857 -0.237630 -0.195396 -0.183581 -0.216979 0.310791 0.120251 0.160937 -0.355483 0.182550 0.230491 -0.607256 -0.640469 -0.655783 -0.599896 0.266529 0.229858 0.251051 0.255837 0.250499 0.240522 0.293936 0.239260 0.209990 0.255003 0.228282 0.249129 0.271987 0.249616
chargesum: 0.00000
title: Mulliken charges with hydrogens summed into heavy atoms:
elementType: O O O N N N N C C C C C C C C C C
charge: -0.256456 -0.274735 -0.272857 -0.237630 -0.195396 -0.183581 -0.216979 0.310791 0.120251 0.160937 0.140904 0.182550 0.230491 0.150132 0.133249 0.037492 0.170837
polarizability: 1.94770052e+02 2.30198575e+00 1.70063370e+02 3.83346518e+00 3.64812869e+00 8.26709847e+01
1716.lowfreq: -7.4314 -4.3725 -0.0008 -0.0008 -0.0001 4.3002 42.2238 69.4376 81.7819
frequency: 42.2066 69.4321 81.7737 93.9864 107.5427 124.1841 131.2591 132.1918 194.3577 210.6397 213.5726 220.1126 240.7812 286.2550 302.2131 308.6970 331.8891 351.1667 359.7998 371.5028 401.4491 420.3440 441.8212 506.4988 537.1308 569.8201 616.4787 693.3741 696.7885 704.1345 721.2795 753.8642 777.1422 819.7726 868.9551 948.1418 962.5777 1000.0413 1026.4623 1057.8727 1085.3931 1103.3987 1125.4970 1130.6679 1130.9504 1185.1189 1190.8259 1225.1278 1239.5542 1270.5196 1294.6661 1317.2481 1343.6877 1365.8801 1392.5722 1402.6747 1414.2110 1429.6303 1453.5948 1466.8036 1469.0666 1470.0549 1476.0106 1476.8382 1482.7791 1485.2624 1488.9961 1503.7900 1518.3300 1574.8504 1617.2743 1650.7440 1680.5490 2989.3481 2998.3417 3008.6759 3011.8018 3033.8198 3081.4228 3091.8815 3093.5401 3103.8967 3104.2994 3110.2299 3121.8679 3122.0142 3138.5148
redmass: 3.1484 4.7651 1.8451 2.8310 2.0348 1.4196 2.1011 2.9324 2.3619 3.6998 1.4402 4.4138 1.0989 3.0755 4.6127 2.7170 3.0316 7.8575 5.0085 5.8107 7.1084 6.6518 4.8622 5.8850 8.5449 3.9953 10.6636 3.9584 9.3474 10.9245 10.9083 3.2840 2.3547 2.4115 4.0092 3.4827 2.3780 2.9661 4.0105 2.5238 2.1888 2.1473 1.2874 1.3032 1.2999 2.4612 3.2654 2.8036 2.8442 6.0491 4.6228 1.2968 3.0824 1.7048 1.2209 1.9328 1.2506 1.2214 1.2115 1.7196 1.0775 1.0567 1.0506 1.0970 1.0483 1.0946 1.1059 1.0654 3.8399 7.5840 9.7432 10.7238 10.3204 1.0362 1.0349 1.0326 1.0328 1.0631 1.0982 1.1006 1.1017 1.1024 1.1023 1.1020 1.1027 1.0993 1.1023
irintensity: 0.0508 0.0201 3.9974 0.0214 0.2713 5.7563 14.6353 0.0192 0.7160 3.5420 1.0205 0.2523 0.2783 1.5638 1.5768 5.3649 0.0980 1.5194 11.6171 2.4294 37.5111 1.7567 8.3282 12.7553 8.6269 19.9061 2.5953 3.4946 0.3547 10.0829 20.0717 2.6300 1.4044 17.2984 8.5763 30.9745 13.0850 77.6866 20.8286 9.3942 28.6896 27.1355 0.3618 0.0041 0.4627 6.1253 8.7307 12.0979 1.0512 29.2147 73.4444 6.5476 148.4893 36.6497 18.0597 16.6622 33.7879 74.2581 10.5683 31.7095 39.5919 16.5652 16.4651 10.5955 14.3551 35.7836 37.2592 37.1003 311.3975 42.0178 524.6663 542.5715 384.5703 19.5271 45.4298 29.4428 29.0929 20.7350 26.1472 19.0211 18.6006 12.3196 21.6255 24.7825 2.0115 0.7770 0.7563
temp: 298.150 k
press: 1.00000 atm
elementType: 8 8 8 7 7 7 7 6 6 6 6 6 6 6 6 6 6 1 1 1 1 1 1 1 1 1 1 1 1 1 1
symmnumber: 1
zpe: 641017.4 jmol-1
zpe.correction: 0.244151 hartree
zpe.thermalcorrener: 0.261176 hartree
zpe.thermalcorrenthalpy: 0.262120 hartree
zpe.thermalcorrgfe: 0.199899 hartree
zpe.sumelectzpe: -832.920658 hartree
zpe.sumelectthermal: -832.903632 hartree
zpe.sumelectthermalent: -832.902688 hartree
zpe.sumelectthermalfe: -832.964910 hartree
dipole: -1.3986 -3.3801 -0.0888
dipole: 3.6591
quadrupole: -114.1216 -99.2798 -98.4850
quadrupole: 11.3815 -1.3060 1.0437
quadrupole: -10.1594 4.6823 5.4771 11.3815 -1.3060 1.0437
hfenergy: -833.1648087 hartree
pointgroup: C01 [X(C10H14N4O3)]
dipole: -0.4998014 1.3496853 0.0307716 debye
polarizability: 194.573446|-3.2406497|170.289932|-3.5013388|3.5688027|82.6410286 unknown
InChI: InChI=1S/C10H14N4O3/c1-5-14-7-6(11(2)10(14)17)8(15)13(4)9(16)12(7)3/h5H2,1-4H3
charge 0 multiplicity 1
31 atoms
O  -3.426922 -1.101127 0.257318
O  1.844693 -2.543805 -0.200818
O  2.967292 2.022048 0.044227
N  -1.654016 0.527893 0.261645
N  -1.097266 -1.65885 0.069339
N  0.687817 1.46516 0.169997
N  2.385159 -0.238867 -0.087195
C  -0.265139 0.453902 0.154776
C  0.089522 -0.894615 0.03953
C  -2.200738 -0.811175 0.201579
C  -2.595984 1.666235 0.288855
C  1.447291 -1.342511 -0.088953
C  2.073593 1.126253 0.040354
C  -1.216554 -3.118543 -0.021298
C  0.373219 2.894413 0.373853
C  -2.962095 2.17345 -1.121047
C  3.825306 -0.55962 -0.22093
H  -3.503578 1.277075 0.78298
H  -2.186802 2.471315 0.918541
H  -0.785665 -3.486329 -0.96654
H  -2.290646 -3.360665 0.02314
H  -0.686252 -3.605645 0.813119
H  -0.338283 3.255885 -0.386254
H  1.322224 3.44181 0.271077
H  -0.031043 3.070492 1.38601
H  -2.080598 2.552772 -1.668802
H  -3.415232 1.360208 -1.713026
H  -3.699155 2.992886 -1.04387
H  4.240261 -0.07145 -1.11785
H  3.906877 -1.653243 -0.303029
H  4.377817 -0.194353 0.660071
