program: Gaussian 09
title: 000095091
version: EM64L-G09RevD.01
frameworkgroup: C1[X(C18H18N4O5)]
method: RPBEPBE
basis: SDD
operation: Freq
keyword: #p
keyword: freq=noraman
keyword: PBEPBE/SDD
title: #p freq=noraman PBEPBE/SDD
converged: YES YES NO NO
title: Mulliken charges:
elementType: O O O O O N N N N C C C C C C C C C C C C C C C C C C H H H H H H H H H H H H H H H H H H
charge: -0.237791 -0.250161 -0.193310 -0.195191 -0.214382 -0.452080 -0.045392 -0.066192 0.022694 -0.400112 0.313807 0.274396 0.209455 -0.336678 -0.383587 0.197459 -0.865318 0.110814 -0.238677 -0.243592 0.295568 -0.273974 -0.480487 0.368273 -0.764424 -0.340190 -0.535342 0.271994 0.377235 0.296080 0.230891 0.224514 0.237869 0.288160 0.228234 0.227533 0.290609 0.306507 0.247958 0.229539 0.293204 0.257837 0.229750 0.256387 0.230111
chargesum: 0.00000
title: Mulliken charges with hydrogens summed into heavy atoms:
elementType: O O O O O N N N N C C C C C C C C C C C C C C C C C C
charge: -0.237791 -0.250161 -0.193310 -0.195191 -0.214382 -0.074845 -0.045392 -0.066192 0.022694 -0.128118 0.313807 0.274396 0.209455 -0.040597 -0.152697 0.197459 -0.114775 0.110814 -0.010443 -0.016059 0.295568 0.016635 -0.173980 0.368273 0.006278 -0.082353 0.180907
polarizability: 3.98995000e+02 -8.61965400e-01 2.84204385e+02 2.72445984e+00 2.59818732e+01 1.70038619e+02
1716.lowfreq: -3.8551 -0.0005 0.0005 0.0008 3.9948 5.3837 14.4147 17.4256 39.4820
frequency: 14.1274 17.4044 39.4719 46.0691 53.8591 59.1843 64.2452 71.8219 84.8526 93.1358 101.6450 122.0281 147.8905 154.7650 171.0435 189.6890 194.6625 208.4658 214.0532 219.9373 256.5147 267.3447 272.4650 295.0125 302.9170 330.2967 338.9721 362.2667 396.3224 413.5841 422.3431 433.9638 447.4205 455.1764 485.0354 513.7622 538.2533 539.0809 562.6240 574.7029 597.1469 628.0964 658.5685 679.0625 682.1394 690.3340 712.1058 727.1236 727.5893 743.1542 763.2036 770.4481 810.0620 824.9804 837.9274 869.8670 877.0282 887.7324 902.0663 936.3438 942.2534 954.0661 961.4883 989.0337 990.6149 996.6093 1011.4585 1030.5777 1049.3221 1050.7152 1054.7505 1108.3528 1111.3744 1136.0662 1160.1018 1165.5836 1175.0189 1183.5047 1190.5722 1200.1951 1216.0778 1223.0124 1239.6166 1266.2616 1268.5881 1284.0989 1295.6875 1351.0154 1370.1410 1370.8767 1374.2225 1410.5588 1417.0932 1434.8200 1437.8985 1440.2865 1440.8529 1446.4231 1463.9703 1468.6393 1469.8224 1480.4254 1481.2425 1497.7532 1524.4927 1559.8074 1595.0229 1615.4930 1618.3843 1623.9597 1632.9455 2931.8563 2969.6294 2971.8924 2985.6719 3046.5707 3065.5373 3070.7531 3088.6908 3124.0729 3126.2735 3138.6641 3139.2454 3155.4656 3161.1438 3175.5517 3191.9654 3195.9767 3476.0991
redmass: 6.9693 5.7954 7.1435 5.3524 7.0613 4.9556 7.1717 5.0376 4.9792 4.7770 4.2504 4.8396 1.4996 3.4635 2.8740 3.5998 3.0824 1.2115 1.9458 2.5204 3.6929 4.3282 4.6398 4.3017 5.2212 8.8315 7.9498 6.3437 5.1904 5.0403 4.2185 4.6040 2.9769 5.5344 3.9203 5.4620 3.3479 4.2248 4.1865 5.2517 5.3089 5.1969 7.0017 4.0784 1.9567 2.5915 7.2309 2.9153 4.6170 5.5558 2.4693 1.9342 5.0510 2.3021 2.2454 3.7628 1.3960 4.3347 1.5374 2.7103 4.1646 1.4233 1.3728 1.5402 1.3531 4.4655 2.7489 2.3403 1.6414 1.9115 3.2258 2.1493 1.2582 1.4425 2.1392 1.5112 1.0977 2.1268 2.8812 2.0280 4.6129 2.4840 1.8843 1.9087 2.3058 1.7119 1.5766 8.1332 1.8119 2.8164 5.0969 1.2502 11.7231 1.2724 2.0334 1.2327 3.1054 1.0756 1.8965 1.1181 1.0889 2.2743 1.1014 1.4271 1.5808 8.7462 5.8432 6.8866 5.7693 6.5304 6.2826 1.0798 1.0394 1.0326 1.0366 1.0968 1.1047 1.0955 1.0965 1.0870 1.1010 1.1002 1.0905 1.0889 1.0985 1.0958 1.0926 1.0948 1.0773
irintensity: 3.0376 0.8158 2.0426 5.6921 1.6000 1.5338 0.3450 3.4903 1.8634 2.7516 2.5239 2.2787 0.3707 1.4130 1.6291 3.3891 4.2189 0.8098 0.7817 0.7188 10.1058 13.2761 4.7680 6.5385 4.9544 2.9564 1.6901 1.5821 0.5021 3.5095 1.4131 1.1502 8.1446 8.7021 12.5613 7.6967 1.9052 8.2271 10.3327 12.8392 7.5435 9.1139 3.3531 22.6753 43.5332 35.5505 18.3544 5.6916 8.1517 2.9523 52.8974 55.0002 2.4626 38.8487 23.3040 11.0169 3.4194 1.4379 26.4135 33.4328 3.7770 5.6095 4.0481 1.6332 1.4402 75.4293 17.7908 17.2803 10.7120 11.8913 18.8968 6.1022 0.1054 7.0662 47.0336 3.1965 0.4000 84.8353 120.1670 28.5302 143.4796 90.0223 153.0091 168.8321 16.3349 42.7526 24.8597 121.5477 156.1168 21.8874 24.8598 19.3184 32.3899 28.7413 78.3633 35.4284 4.6834 29.4024 72.3011 80.7920 47.4816 98.4326 19.8187 117.5135 144.8790 5.8434 52.1778 158.5261 6.7849 119.2087 151.7069 25.6162 23.1948 63.7347 6.0469 10.6647 37.0764 9.7948 15.0865 5.9929 13.5699 18.6838 18.8257 2.1262 36.9601 7.7586 6.9045 4.2248 41.9334
temp: 298.150 k
press: 1.00000 atm
elementType: 8 8 8 8 8 7 7 7 7 6 6 6 6 6 6 6 6 6 6 6 6 6 6 6 6 6 6 1 1 1 1 1 1 1 1 1 1 1 1 1 1 1 1 1 1
symmnumber: 1
zpe: 882829.7 jmol-1
zpe.correction: 0.336252 hartree
zpe.thermalcorrener: 0.362360 hartree
zpe.thermalcorrenthalpy: 0.363305 hartree
zpe.thermalcorrgfe: 0.277284 hartree
zpe.sumelectzpe: -1289.754398 hartree
zpe.sumelectthermal: -1289.728289 hartree
zpe.sumelectthermalent: -1289.727345 hartree
zpe.sumelectthermalfe: -1289.813366 hartree
dipole: -4.1937 0.1148 0.3484
dipole: 4.2097
quadrupole: -115.0699 -169.8333 -154.1547
quadrupole: -10.3687 -18.5959 -7.0136
quadrupole: 31.2828 -23.4807 -7.8021 -10.3687 -18.5959 -7.0136
hfenergy: -1290.0906498 hartree
pointgroup: C01 [X(C18H18N4O5)]
dipole: -1.6515662 0.0906866 -0.0849776 debye
polarizability: 398.1678866|-7.1923142|282.2218351|-7.6265103|31.3494534|172.8482827 unknown
InChI: InChI=1S/C18H18N4O5/c1-11-6-4-5-7-14(11)19-18(24)17(12(2)23)21-20-15-9-8-13(27-3)10-16(15)22(25)26/h4-10,17,19H,1-3H3
charge 0 multiplicity 1
45 atoms
O  2.652269 -2.468782 -0.933165
O  -5.966886 1.55654 -0.338298
O  -0.579445 -4.274012 0.500524
O  -1.873471 3.09671 2.050202
O  -0.226792 1.804296 1.139846
N  2.362017 -0.454315 0.255309
N  -0.421398 -1.617148 0.059581
N  -0.928262 -0.716213 0.841081
N  -1.474325 2.087414 1.351586
C  0.772443 -2.264287 0.677827
C  3.442364 0.344972 -0.241149
C  3.778715 1.528333 0.490153
C  2.035593 -1.75501 -0.09162
C  4.155967 -0.009738 -1.415502
C  4.823545 2.340303 -0.009279
C  0.574494 -3.801424 0.655644
C  3.060962 1.90451 1.775212
C  -2.149095 -0.133563 0.389168
C  5.196681 0.820857 -1.880463
C  5.532269 2.002441 -1.184057
C  -2.488891 1.203794 0.750362
C  -3.141763 -0.913439 -0.257029
C  -3.761419 1.741109 0.50722
C  -4.735704 0.940238 -0.136011
C  1.791248 -4.663685 0.907635
C  -4.418265 -0.390457 -0.526639
C  -7.018309 0.79161 -1.02405
H  0.865354 -1.962274 1.746443
H  1.726189 0.015734 0.910206
H  3.897908 -0.929259 -1.943157
H  5.08821 3.2505 0.541536
H  3.131722 1.099655 2.533368
H  3.512155 2.808452 2.216702
H  1.987613 2.123838 1.618633
H  5.741092 0.540353 -2.7887
H  6.338537 2.650259 -1.544597
H  -2.887363 -1.9462 -0.517263
H  -3.992882 2.769384 0.794067
H  1.477944 -5.694383 1.133804
H  2.409375 -4.261591 1.732077
H  2.426982 -4.648183 0.002735
H  -5.158487 -1.020059 -1.027971
H  -7.291238 -0.112989 -0.448402
H  -7.877439 1.47498 -1.073034
H  -6.703715 0.510128 -2.046636
