program: Gaussian 09
title: 000094913
version: EM64L-G09RevD.01
frameworkgroup: C1[X(C10H13BrO)]
method: RPBEPBE
basis: SDD
operation: Freq
keyword: #p
keyword: freq=noraman
keyword: PBEPBE/SDD
title: #p freq=noraman PBEPBE/SDD
converged: YES YES NO NO
title: Mulliken charges:
elementType: Br O C C C C C C C C C C H H H H H H H H H H H H H
charge: -0.022691 -0.271932 -0.357965 -0.272510 0.378461 0.474395 -0.556949 -0.670763 -0.376420 -0.398100 -0.212758 -0.804744 0.246660 0.246537 0.204199 0.204923 0.254675 0.275224 0.275149 0.245369 0.230801 0.221281 0.226490 0.235624 0.225045
chargesum: 0.00000
title: Mulliken charges with hydrogens summed into heavy atoms:
elementType: Br O C C C C C C C C C C
charge: -0.022691 -0.271932 0.135231 0.136611 0.378461 0.474395 -0.302274 -0.120390 -0.131051 -0.167299 0.008523 -0.117584
polarizability: 1.95141401e+02 -5.09973645e+00 1.20134499e+02 -1.66205670e-01 -1.97804489e-01 6.59793599e+01
1716.lowfreq: -39.4236 0.0003 0.0005 0.0006 4.0245 7.6207 15.4868 33.3160 54.9275
frequency: -38.9804 32.5928 54.9105 60.0821 102.2416 140.1010 141.1673 202.7307 211.8317 232.6302 323.4517 352.9545 443.4323 455.4591 510.5879 561.6904 595.4120 629.3953 692.7509 728.7403 766.2462 777.9703 851.6133 869.1805 888.4358 892.2387 966.6189 977.8662 983.8812 1024.5767 1027.1510 1046.4049 1056.6559 1065.0222 1100.5879 1154.2871 1156.1932 1184.1824 1230.1189 1254.5036 1257.3472 1284.8762 1297.9204 1314.5000 1376.3530 1391.8029 1396.0175 1435.9764 1455.4853 1470.8213 1473.4589 1475.3020 1480.7748 1491.4039 1590.2792 1623.4466 2943.1692 2976.9715 2999.5078 3026.3836 3047.7552 3058.0926 3087.6089 3088.4048 3123.9210 3131.6062 3143.7767 3148.8097 3165.2860
redmass: 1.0174 6.2710 5.5627 2.5535 2.8074 8.4968 2.1463 4.1612 3.0806 4.9456 3.2445 4.0264 2.8655 4.1854 5.1254 3.6170 6.2852 5.3615 2.0451 6.6644 1.1196 1.4402 1.2145 1.2838 3.7183 1.5210 1.3217 2.3451 3.7908 2.5038 1.1792 1.5572 4.6822 2.7965 1.6003 1.8305 1.2494 1.1385 1.1817 3.9302 1.2493 1.0870 1.3278 1.3143 1.9200 2.9885 1.2335 2.1805 1.1027 1.0920 1.0811 1.8367 1.3992 1.1371 5.9429 6.5697 1.0546 1.0383 1.1072 1.0601 1.0561 1.0956 1.0996 1.1049 1.0862 1.1107 1.0928 1.0921 1.0969
irintensity: 0.3985 0.0025 0.3155 4.1539 2.4016 0.4247 2.2518 2.3160 1.0765 0.7441 1.3405 9.9827 6.5004 2.8668 0.2532 0.1280 8.1794 28.7779 24.6597 19.6928 26.1805 41.2217 3.0613 1.6979 12.0289 14.7806 0.1498 16.0739 0.7556 74.8800 0.7952 18.6221 1.2589 18.9805 8.4431 134.5082 1.9030 1.1894 26.2784 135.1042 1.0005 0.0797 4.5210 26.8420 10.4429 29.8183 13.6640 12.8060 3.1608 12.4332 8.9451 12.1285 91.2454 0.9230 67.5343 96.3352 39.0022 33.7984 36.8795 5.3009 25.2758 22.8387 19.2633 10.3377 4.4390 19.6817 35.2448 4.3965 13.6488
temp: 298.150 k
press: 1.00000 atm
elementType: 35 8 6 6 6 6 6 6 6 6 6 6 1 1 1 1 1 1 1 1 1 1 1 1 1
symmnumber: 1
zpe: 535346.6 jmol-1
zpe.correction: 0.203903 hartree
zpe.thermalcorrener: 0.216022 hartree
zpe.thermalcorrenthalpy: 0.216966 hartree
zpe.thermalcorrgfe: 0.162891 hartree
zpe.sumelectzpe: -476.631691 hartree
zpe.sumelectthermal: -476.619572 hartree
zpe.sumelectthermalent: -476.618628 hartree
zpe.sumelectthermalfe: -476.672703 hartree
dipole: -1.9165 1.8936 0.0511
dipole: 2.6947
quadrupole: -86.0922 -75.6097 -84.5598
quadrupole: 4.1816 -0.2520 -0.0474
quadrupole: -4.0049 6.4775 -2.4726 4.1816 -0.2520 -0.0474
hfenergy: -476.8355941 hartree
pointgroup: C01 [X(C10H13Br1O1)]
dipole: -0.7261697 0.7668995 0.092156 debye
dipolederiv: -0.5929452 0.0771015 0.0192076 0.1834818 -0.1928241 -0.0092703 0.0262325 -0.0059218 -0.1403884 -2.0673704 0.0890401 0.0591526 0.2130754 -0.3171958 -0.0086402 0.0656852 -0.0052812 -0.2815667 -0.2523305 0.0140834 0.011571 0.1598985 -0.0066094 -0.011928 0.0216651 -0.0076152 0.0982262 0.9641125 0.0676954 -0.0127335 0.2788813 0.3152154 -0.0146875 0.0011822 -0.0090645 0.4155938 1.6196798 -0.1822076 -0.0583153 -0.5597997 0.1986159 0.0241974 -0.0746678 0.015842 0.1185738 0.3698451 0.1078936 -0.0164057 0.1551733 0.2887753 0.0043474 -0.0595482 -0.0301716 -0.0235969 -0.5700365 -0.0242891 0.0134845 -0.160418 -0.0038858 0.0138446 0.0063474 0.0168807 -0.2002685 0.7787744 -0.2264697 -0.0349672 -0.2108552 0.2311866 0.0128057 -0.0342002 0.0132912 0.1386035 -0.3358887 -0.0044874 0.0051746 0.3662098 -0.1597631 -0.0033961 0.0269377 0.0045891 -0.2344036 -0.1152768 -0.1036232 -0.0151598 -0.1470582 -0.2749124 0.0044241 -0.0133017 0.0064144 -0.2145271 0.2118241 0.0654344 -0.0018816 -0.0394247 0.1529297 0.0160398 -0.0045114 0.0192742 -0.1283134 -0.0717515 -0.1236847 0.0062096 -0.096697 -0.0168625 0.0053946 0.0810054 0.0582365 0.0682746 0.0848703 -0.0073235 -0.0058052 -0.0122112 0.0248987 -0.0806441 -0.0034384 -0.0865108 -0.0449219 0.0854239 -0.0023038 -0.0021027 -0.0072287 0.0022832 0.0873344 -0.0049933 0.092984 -0.0223444 -0.0246355 0.0072049 0.0173204 -0.1020405 -0.0359181 -0.0938465 -0.0226681 -0.1111072 -0.1023109 -0.0258049 0.0173959 -0.020296 -0.0971658 -0.0620992 0.104677 0.0059457 0.1151492 -0.0749482 0.1006517 0.0341687 0.0009249 0.0404547 -0.0588572 -0.0176202 0.0022791 -0.0219028 0.1628068 -0.0311455 0.0757989 0.0339548 0.0301102 -0.0159406 -0.0928412 -0.012902 -0.1024604 -0.0321903 -0.0319268 0.0859124 -0.0223812 0.0338043 -0.0415088 0.0896039 0.0180404 0.0960461 -0.0058997 -0.0232186 -0.10547 -0.0018443 -0.1282453 0.020386 -0.0064016 -0.0040587 -0.0078418 0.1709308 -0.1285245 0.0577093 0.0109401 0.0420243 0.0761448 -0.0094863 0.0041899 -0.0090488 0.1624476 0.0588196 0.0427798 0.0043698 0.058915 -0.1235066 -0.0198582 0.0041893 -0.0192973 0.1506201 0.0528379 0.0968635 0.0484245 0.0023245 -0.0936549 -0.0784205 -0.0021667 -0.095115 0.0713612 0.0262361 -0.064954 0.0594587 -0.0730995 0.050288 0.0238838 0.0985101 0.0627805 -0.0952842 -0.08222 0.0057312 -0.0983006 0.0698907 0.0428151 0.0604879 -0.1257537 0.0098504 0.0435259 unknown
polarizability: 194.5532029|-7.4619206|120.3573006|-4.6286754|3.551289|66.3447568 unknown
InChI: InChI=1S/C10H13BrO/c1-9-4-2-5-10(8-9)12-7-3-6-11/h2,4-5,8H,3,6-7H2,1H3
charge 0 multiplicity 1
25 atoms
Br 6.039675 -0.584681 -0.170945
O  0.70221 -0.535404 0.002851
C  3.100266 -0.402356 -0.066933
C  1.810072 0.428935 0.026901
C  -0.609375 -0.024729 0.074978
C  -2.993612 -0.62212 0.096542
C  -1.634938 -1.000831 0.033294
C  4.332224 0.507428 -0.04484
C  -0.927158 1.350961 0.177524
C  -3.314012 0.760422 0.196682
C  -2.289781 1.727695 0.237636
C  -4.092734 -1.671094 0.079497
H  3.07946 -0.99708 -0.996903
H  3.132801 -1.112549 0.7778
H  1.779895 1.017179 0.968668
H  1.72042 1.129049 -0.830705
H  -1.346373 -2.054132 -0.050442
H  4.432562 1.0716 0.895874
H  4.375963 1.19201 -0.906649
H  -0.148884 2.119046 0.207494
H  -4.364179 1.071733 0.240581
H  -2.546451 2.790527 0.313423
H  -3.740628 -2.622944 -0.354016
H  -4.451047 -1.885781 1.104999
H  -4.965076 -1.329484 -0.506011
