program: Gaussian 09
title: 000094937
version: EM64L-G09RevD.01
frameworkgroup: C1[X(C11H11FN2O2)]
method: RPBEPBE
basis: SDD
operation: Freq
keyword: #p
keyword: freq=noraman
keyword: PBEPBE/SDD
title: #p freq=noraman PBEPBE/SDD
converged: NO YES NO NO
title: Mulliken charges:
elementType: F O O N N C C C C C C C C C C C H H H H H H H H H H H
charge: -0.214094 -0.400034 -0.250434 -0.409979 -0.576513 0.426407 -0.594351 0.100159 -0.170352 0.282256 -0.436810 -0.372799 -0.506772 -0.416842 0.190198 0.355964 0.230026 0.212076 0.256345 0.268917 0.309781 0.261320 0.256838 0.252679 0.294310 0.271622 0.380082
chargesum: 0.00000
title: Mulliken charges with hydrogens summed into heavy atoms:
elementType: F O O N N C C C C C C C C C C C
charge: -0.214094 -0.019952 -0.250434 -0.100199 -0.010581 0.426407 -0.152249 0.100159 0.085993 0.282256 -0.167893 -0.111479 -0.249934 -0.164163 0.190198 0.355964
polarizability: 1.71067458e+02 1.63648701e+01 1.48879665e+02 -1.67561503e+01 1.61830906e+01 8.73727367e+01
1716.lowfreq: -9.3687 -4.9092 -0.0006 0.0001 0.0006 5.0387 32.6632 42.7406 53.4143
frequency: 32.6012 42.7188 53.4075 71.7974 119.1830 162.4216 209.6715 228.7986 249.9092 275.7805 293.2755 311.5415 347.3202 388.2695 427.2895 444.6321 466.5998 474.1029 517.7754 551.4558 584.8745 599.8778 606.8640 613.2543 631.0030 690.5801 726.2047 747.0723 756.2340 772.9523 793.3148 803.6541 810.5594 839.1456 935.2675 938.5332 940.6737 966.3362 1055.8199 1064.5227 1088.8076 1104.3451 1126.1953 1128.8676 1147.8166 1186.6916 1237.6727 1248.9923 1268.4855 1287.8628 1297.8893 1313.5433 1336.7028 1389.8568 1405.4161 1411.4517 1460.5807 1465.8945 1491.0835 1561.2632 1592.9257 1612.2601 1634.8014 1664.1581 2983.2620 3037.7338 3058.3851 3147.3705 3169.4627 3177.7607 3219.6836 3469.4011 3498.8744 3605.7948 3613.5996
redmass: 5.3014 6.8727 9.7862 4.5781 7.3149 6.0778 3.6628 1.4467 3.3496 3.4263 2.3245 6.1214 4.8559 5.3865 3.0645 4.9998 5.7130 3.5057 1.1607 1.4976 3.1452 3.1691 4.0277 2.4012 1.8043 4.1439 4.3788 4.0639 3.1371 3.1294 2.0042 2.3518 2.0585 1.5812 2.3453 2.4258 1.3911 5.1396 3.3979 2.8174 1.6952 1.6651 1.5353 1.5172 1.5356 1.5040 2.1731 1.6799 1.7045 1.4493 2.1062 1.2652 1.8826 5.2380 2.4802 2.2798 1.2184 3.5425 3.6515 6.3494 7.0169 1.3862 7.1319 3.1703 1.0596 1.0970 1.0927 1.0896 1.0934 1.0958 1.0984 1.0446 1.0637 1.0988 1.0810
irintensity: 0.1545 1.7947 3.0807 2.3536 0.9348 0.3178 3.6779 56.3697 9.7346 11.8933 9.2816 3.0598 2.9646 3.6174 6.1772 17.4516 0.9923 16.4877 95.2390 224.5384 0.1719 80.3741 5.7560 71.1106 172.3957 12.0795 27.3684 5.1568 1.5983 0.7843 24.6477 49.8091 10.0934 56.6127 10.1343 26.6751 0.7852 12.8953 10.2738 216.6321 39.7486 13.3430 47.9811 0.9981 7.3044 9.3632 19.5958 19.7082 3.1663 3.2308 7.9146 0.9700 48.6064 32.1261 8.0602 17.8922 12.9644 24.3874 26.6203 17.1392 7.9209 157.0914 45.4922 90.0663 38.9889 7.6597 23.3153 2.5313 2.1733 3.5662 0.9632 7.4081 18.7197 7.3230 65.0073
temp: 298.150 k
press: 1.00000 atm
elementType: 9 8 8 7 7 6 6 6 6 6 6 6 6 6 6 6 1 1 1 1 1 1 1 1 1 1 1
symmnumber: 1
zpe: 538260.9 jmol-1
zpe.correction: 0.205013 hartree
zpe.thermalcorrener: 0.219560 hartree
zpe.thermalcorrenthalpy: 0.220504 hartree
zpe.thermalcorrgfe: 0.162526 hartree
zpe.sumelectzpe: -784.416116 hartree
zpe.sumelectthermal: -784.401570 hartree
zpe.sumelectthermalent: -784.400626 hartree
zpe.sumelectthermalfe: -784.458604 hartree
dipole: 0.9936 4.4014 0.2961
dipole: 4.5219
quadrupole: -101.8154 -80.5530 -91.4739
quadrupole: -0.4618 -8.8162 1.6746
quadrupole: -10.5346 10.7278 -0.1932 -0.4618 -8.8162 1.6746
hfenergy: -784.6211292 hartree
pointgroup: C01 [X(C11H11F1N2O2)]
dipole: -0.3585565 -1.7397748 0.0979577 debye
polarizability: 170.735943|16.4249124|149.8641082|16.5810589|-15.2382402|86.719808 unknown
InChI: InChI=1S/C11H11FN2O2/c12-7-1-2-8-6(3-9(13)11(15)16)5-14-10(8)4-7/h1-2,4-5,9,14-15H,3,13H2
charge 0 multiplicity 1
27 atoms
F  4.351947 1.39411 0.096012
O  -1.759503 0.96518 1.894906
O  -2.450478 2.132522 0.012226
N  1.1670 -2.369654 0.483418
N  -4.321786 -0.00565 -0.310128
C  -0.607955 -1.231834 -0.412362
C  -1.996106 -0.895051 -0.893128
C  0.549005 -0.347133 -0.379621
C  -2.96793 -0.268735 0.192197
C  1.645613 -1.092163 0.186867
C  -0.187808 -2.450505 0.119949
C  0.766134 0.99874 -0.781047
C  2.935206 -0.540071 0.361157
C  2.04259 1.569757 -0.619405
C  -2.394617 1.062282 0.662597
C  3.082205 0.78894 -0.055252
H  -1.957848 -0.186949 -1.743676
H  -2.50531 -1.808627 -1.256679
H  -3.011029 -0.9549 1.054949
H  -0.750348 -3.371686 0.263115
H  1.713552 -3.125995 0.888482
H  -0.045638 1.594701 -1.210951
H  3.778519 -1.089771 0.788164
H  2.252643 2.600648 -0.917733
H  -4.383907 0.816314 -0.918908
H  -4.813696 -0.826164 -0.671178
H  -1.336455 1.838696 2.12193
