program: Gaussian 09
title: 000094887
version: EM64L-G09RevD.01
frameworkgroup: C1[X(C12H16O2)]
method: RPBEPBE
basis: SDD
operation: Freq
keyword: #pfreq=noraman
keyword: PBEPBE/SDD
title: #p freq=noraman PBEPBE/SDD
converged: YES YES NO NO
title: Mulliken charges:
elementType: O O C C C C C C C C C C C C H H H H H H H H H H H H H H H H
charge: -0.288410 -0.224240 0.495713 -0.487143 -0.340074 -0.533598 0.351217 -0.398910 -0.375694 -0.321631 -0.403056 0.215774 -0.683770 -0.670588 0.243353 0.241454 0.214734 0.221007 0.210631 0.208680 0.233111 0.235307 0.300213 0.253069 0.208884 0.208503 0.223688 0.221448 0.216795 0.223533
chargesum: 0.00000
title: Mulliken charges with hydrogens summed into heavy atoms:
elementType: O O C C C C C C C C C C C C
charge: -0.288410 -0.224240 0.495713 -0.002336 0.095667 -0.114287 0.351217 -0.165799 -0.140387 -0.021418 -0.149987 0.215774 -0.042694 -0.008811
polarizability: 2.09834969e+02 1.32987632e+00 1.28225994e+02 -1.25813393e+00 1.40638214e+00 8.15616268e+01
1716.lowfreq: -24.3625 -1.9740 0.0002 0.0005 0.0007 5.9337 13.9013 29.4968 35.1546
frequency: -21.3991 29.1514 35.1388 40.7788 77.7078 85.8465 125.5606 184.3733 214.6598 230.2946 234.5111 271.0696 307.1677 350.3586 379.8581 402.8518 411.7266 502.0640 532.4424 553.7405 625.0421 691.9325 704.2393 733.5210 735.1153 785.6662 794.2404 838.3713 852.2596 865.1526 873.9388 927.7175 959.3596 968.8062 980.5216 1009.5004 1044.5334 1052.4801 1062.7682 1090.4113 1100.2627 1122.5310 1125.8928 1152.9202 1195.6518 1217.6819 1218.2002 1242.6012 1281.0141 1288.6150 1305.2412 1313.3836 1357.3939 1380.2754 1389.5711 1392.7257 1411.5581 1437.1871 1471.8118 1473.2828 1473.6481 1479.8199 1486.1390 1488.2056 1493.3334 1585.4049 1617.5989 1648.6965 2974.0419 2979.3188 2984.4098 2987.0633 3003.2108 3030.9748 3037.7743 3051.4969 3077.3073 3078.0321 3078.1453 3083.7769 3124.8769 3127.7524 3165.2002 3209.5738
redmass: 1.9412 3.5526 2.9967 4.0056 3.2696 3.2463 3.9089 2.3669 1.8877 2.4783 1.0880 4.0418 3.6870 3.4529 2.8118 4.4620 3.0165 4.3691 2.8176 2.7620 6.8157 5.0069 5.6160 2.4175 1.3817 1.1872 4.9402 1.3565 1.4112 1.3212 3.1393 2.5621 1.3424 2.3753 1.3413 2.7980 1.4560 2.3476 2.0640 2.8258 1.7585 1.4692 1.9881 2.2494 1.3600 1.8246 1.7471 1.2559 1.1949 1.3358 1.2889 1.5145 1.6915 5.9324 1.1972 1.2138 3.0408 1.0864 1.0480 1.0588 1.0854 1.0426 1.0801 1.2415 1.8639 7.1131 6.5357 10.1154 1.0361 1.0349 1.0621 1.0600 1.0608 1.0969 1.1016 1.1003 1.0992 1.1002 1.1016 1.1012 1.0901 1.0903 1.0954 1.0941
irintensity: 0.0182 1.1026 0.8095 0.1065 0.9946 1.6046 0.6473 1.9969 0.5263 2.5824 0.0610 2.9907 7.4927 2.0214 0.3146 0.3769 0.1281 5.4382 4.9292 15.5075 0.9776 1.0043 7.0460 7.7349 7.6415 2.9792 0.8531 25.4738 50.3685 0.0180 2.2600 66.3666 2.0139 9.0132 1.2672 11.0020 7.7647 49.4315 33.9806 217.0112 44.2129 60.6960 231.3621 109.7862 74.4698 6.7342 14.7103 0.6980 19.5540 44.6816 1.2106 3.5454 24.2626 9.9266 9.0798 8.0136 6.8257 24.3195 13.4608 7.5994 3.8034 12.9752 15.1817 18.5831 106.5942 3.3551 3.1935 179.5174 39.1901 41.2660 7.4490 38.1175 22.0178 1.9695 8.0898 0.1099 53.0611 55.1796 78.7618 40.3057 18.8795 17.0720 5.8323 2.5890
temp: 298.150 k
press: 1.00000 atm
elementType: 8 8 6 6 6 6 6 6 6 6 6 6 6 6 1 1 1 1 1 1 1 1 1 1 1 1 1 1 1 1
symmnumber: 1
zpe: 656202.4 jmol-1
zpe.correction: 0.249934 hartree
zpe.thermalcorrener: 0.264120 hartree
zpe.thermalcorrenthalpy: 0.265064 hartree
zpe.thermalcorrgfe: 0.207006 hartree
zpe.sumelectzpe: -616.274493 hartree
zpe.sumelectthermal: -616.260307 hartree
zpe.sumelectthermalent: -616.259363 hartree
zpe.sumelectthermalfe: -616.317421 hartree
dipole: 0.4411 1.5915 0.0956
dipole: 1.6543
quadrupole: -68.7274 -83.5085 -86.4247
quadrupole: -3.9611 -0.7052 0.1778
quadrupole: 10.8261 -3.9550 -6.8711 -3.9611 -0.7052 0.1778
hfenergy: -616.5244274 hartree
pointgroup: C01 [X(C12H16O2)]
dipole: 0.1638117 -0.3465605 -0.5259885 debye
polarizability: 209.7553799|0.3505445|97.2681775|-3.2957911|22.0980477|112.5990324 unknown
InChI: InChI=1S/C12H16O2/c1-3-5-12(13)14-11-8-6-10(4-2)7-9-11/h6-9H,3-5H2,1-2H3
charge 0 multiplicity 1
30 atoms
O  -1.178254 -0.316001 -0.385208
O  -2.063059 0.958734 1.390212
C  3.044565 -0.076826 0.17189
C  -3.552255 -0.176762 -0.228668
C  -4.764769 0.509867 0.431039
C  4.558809 0.011534 0.298086
C  0.21993 -0.169724 -0.110629
C  2.191538 0.584361 1.089559
C  2.442388 -0.792336 -0.896703
C  0.783219 0.552076 0.967375
C  1.042304 -0.84227 -1.042059
C  -2.2241 0.244017 0.379367
C  -6.09795 0.019207 -0.17068
C  5.15316 1.187789 -0.523329
H  -3.517737 0.028054 -1.315925
H  -3.630923 -1.279062 -0.136891
H  -4.67403 1.605896 0.31124
H  -4.743051 0.31923 1.51991
H  4.840445 0.1371 1.360945
H  5.020543 -0.934658 -0.044184
H  2.631615 1.139148 1.927408
H  3.075885 -1.320497 -1.619642
H  0.145248 1.066771 1.685921
H  0.571698 -1.39633 -1.859982
H  -6.149959 0.225549 -1.256502
H  -6.224206 -1.070983 -0.029232
H  -6.957383 0.521878 0.308289
H  4.914558 1.079619 -1.597004
H  6.252891 1.227342 -0.416758
H  4.738179 2.154078 -0.183946
