program: Gaussian 09
title: 000094888
version: EM64L-G09RevD.01
frameworkgroup: C1[X(C13H12N2)]
method: RPBEPBE
basis: SDD
operation: Freq
keyword: #pfreq=noraman
keyword: PBEPBE/SDD
title: #p freq=noraman PBEPBE/SDD
converged: YES YES NO NO
title: Mulliken charges:
elementType: N N C C C C C C C C C C C C C H H H H H H H H H H H H
charge: -0.396336 -0.164706 0.427035 -0.426699 -0.328966 0.309789 -0.200215 -0.221732 -0.376315 -0.376275 -0.254263 -0.222156 -0.204347 -0.204454 -0.256906 0.214383 0.321350 0.306108 0.225260 0.225980 0.242136 0.242095 0.227907 0.220334 0.222701 0.222691 0.225601
chargesum: 0.00000
title: Mulliken charges with hydrogens summed into heavy atoms:
elementType: N N C C C C C C C C C C C C C
charge: -0.090228 -0.164706 0.427035 -0.212315 -0.007616 0.309789 0.025045 0.004248 -0.134179 -0.134180 -0.026356 -0.001821 0.018354 0.018236 -0.031305
polarizability: 2.66500598e+02 5.00347855e+00 1.20818352e+02 -1.86827006e-02 5.03774014e-02 1.02578110e+02
1716.lowfreq: -62.4935 -8.2030 -3.2502 -0.0002 0.0006 0.0008 10.4294 39.6139 56.1934
frequency: -62.4900 39.4900 56.1877 73.9352 142.8693 176.9335 250.0007 288.0563 332.9182 404.1277 411.3456 444.8664 476.8380 504.0022 520.3670 557.6426 591.8873 613.6385 614.0662 695.7694 698.6312 720.2852 755.1484 764.8140 778.1150 835.5392 842.3935 882.8261 900.5281 916.9731 944.7908 963.4910 971.9097 982.0379 983.6412 984.2052 1005.8853 1021.8195 1024.2033 1074.0281 1083.7572 1102.8868 1167.6591 1171.5315 1176.8193 1186.3376 1208.1791 1298.5343 1304.4707 1323.8131 1370.3327 1381.7006 1397.0787 1433.8267 1434.2737 1477.1406 1485.8567 1525.6630 1579.1912 1600.7859 1605.4191 1615.7742 1666.9015 2986.6494 3105.7574 3121.9102 3128.8698 3130.7596 3142.6933 3145.6885 3151.9775 3164.1176 3165.6141 3183.2936 3550.3055
redmass: 3.8239 4.5762 5.1186 4.2314 5.4558 3.4470 4.9046 4.7901 3.4232 2.9526 2.9766 5.9621 5.9185 4.2427 2.6914 4.3578 1.1920 6.3596 6.4287 2.0366 1.9795 4.7379 2.4007 1.7113 3.1248 1.2429 1.2737 4.1925 1.6602 1.4131 1.4702 1.3655 1.3422 1.7178 4.5963 3.3777 1.2971 2.1800 2.2365 1.5421 1.6362 2.9604 1.0515 1.0562 1.1298 1.1175 2.6613 1.7018 1.3774 1.6149 6.1193 2.6856 1.8886 2.2732 2.3921 2.3329 2.2509 2.1729 6.2179 4.8977 5.5599 6.0475 6.3592 1.0887 1.0886 1.0842 1.0880 1.0866 1.0932 1.0922 1.0964 1.0993 1.1015 1.0962 1.0766
irintensity: 4.8785 0.4562 0.2673 3.9619 3.4020 9.6151 0.2128 3.7830 10.0502 0.4084 0.2483 0.0393 5.1676 10.3603 22.7745 5.0374 58.7855 0.7741 1.2099 32.0504 45.7107 16.4448 50.5642 88.1948 17.9014 0.0307 0.1485 13.5951 9.7720 8.8793 9.2318 0.0303 0.1992 0.3617 0.8501 0.5312 3.6627 13.1442 10.7820 11.1806 21.4626 89.6961 0.3178 0.6279 1.8741 3.1803 61.9679 0.5297 0.0134 19.3537 2.0613 22.9801 26.3499 53.1202 1.8487 159.2410 44.9216 326.2513 5.7503 108.9853 134.6679 85.4000 688.7707 57.8255 16.6003 5.0371 6.1418 0.2546 32.9987 24.0637 35.8974 26.4047 18.2563 15.6863 28.4587
temp: 298.150 k
press: 1.00000 atm
elementType: 7 7 6 6 6 6 6 6 6 6 6 6 6 6 6 1 1 1 1 1 1 1 1 1 1 1 1
symmnumber: 1
zpe: 567160.2 jmol-1
zpe.correction: 0.216020 hartree
zpe.thermalcorrener: 0.227588 hartree
zpe.thermalcorrenthalpy: 0.228532 hartree
zpe.thermalcorrgfe: 0.177172 hartree
zpe.sumelectzpe: -611.035022 hartree
zpe.sumelectthermal: -611.023454 hartree
zpe.sumelectthermalent: -611.022510 hartree
zpe.sumelectthermalfe: -611.073869 hartree
dipole: 1.0811 2.7663 -0.0088
dipole: 2.9701
quadrupole: -78.4351 -79.1664 -87.6738
quadrupole: 2.9483 -0.0098 -0.0056
quadrupole: 3.3233 2.5920 -5.9154 2.9483 -0.0098 -0.0056
hfenergy: -611.2510416 hartree
pointgroup: C01 [X(C13H12N2)]
dipole: 0.4186054 1.0909578 -0.0018677 debye
polarizability: 266.4331057|5.904454|120.8856489|-0.0239681|0.0772885|102.5783057 unknown
InChI: InChI=1S/C13H12N2/c1-3-7-12(8-4-1)14-11-15-13-9-5-2-6-10-13/h1-11,14H
charge 0 multiplicity 1
27 atoms
N  1.248417 1.528269 -0.00312
N  -0.690869 0.133288 -0.000808
C  2.323018 0.596693 -0.001336
C  3.644455 1.125236 -0.00215
C  2.127445 -0.810983 0.001213
C  -2.109514 0.009166 -0.000201
C  4.75583 0.259869 -0.000409
C  3.253536 -1.662839 0.00295
C  -2.822394 -0.094083 -1.22623
C  -2.822463 -0.082856 1.226695
C  4.568014 -1.142896 0.002173
C  -0.122842 1.308143 -0.002721
C  -4.222763 -0.275486 -1.219966
C  -4.222829 -0.264375 1.222027
C  -4.932031 -0.36025 0.001428
H  3.79902 2.212738 -0.004123
H  1.108204 -1.201711 0.001755
H  1.526256 2.511081 -0.00488
H  5.767468 0.680771 -0.00105
H  3.096177 -2.747464 0.004927
H  -2.268144 -0.043992 -2.16988
H  -2.268276 -0.024219 2.169896
H  5.431841 -1.816014 0.003544
H  -0.700617 2.253199 -0.00427
H  -4.760657 -0.351574 -2.172194
H  -4.760776 -0.331836 2.174877
H  -6.018006 -0.503574 0.002054
