program: Gaussian 09
title: 000094880
version: EM64L-G09RevD.01
frameworkgroup: C1[X(C11H8N2S)]
method: RPBEPBE
basis: SDD
operation: Freq
keyword: #p
keyword: freq=noraman
keyword: PBEPBE/SDD
title: #p freq=noraman PBEPBE/SDD
converged: NO YES NO YES
title: Mulliken charges:
elementType: S N N C C C C C C C C C C C H H H H H H H H
charge: 0.212194 -0.043059 -0.566017 0.250971 0.262475 0.456762 -0.400250 -0.472626 -0.312672 -0.392223 -0.432008 -0.240795 -0.187839 -0.240769 0.238536 0.241300 0.268857 0.237700 0.227243 0.225454 0.330767 0.335998
chargesum: 0.00000
title: Mulliken charges with hydrogens summed into heavy atoms:
elementType: S N N C C C C C C C C C C C
charge: 0.212194 -0.043059 0.100748 0.250971 0.262475 0.456762 -0.400250 -0.234090 -0.071371 -0.123367 -0.194308 -0.013553 -0.187839 -0.015315
polarizability: 2.44715871e+02 1.50044394e+00 1.66359768e+02 3.98886508e-03 -2.04765819e-03 5.54623823e+01
1716.lowfreq: -9.1442 -0.0027 -0.0016 -0.0004 4.5572 9.2719 96.1404 105.3909 180.8948
frequency: 96.1346 105.3909 180.8943 183.2219 249.2995 299.3509 321.6089 326.1949 363.1182 418.5801 440.6783 441.9948 482.0363 504.1329 527.7008 560.1067 565.6661 593.0959 610.1996 645.3548 683.6559 752.8138 754.3715 796.6122 816.9297 858.3743 873.5539 891.1762 948.3075 973.1570 995.0828 1011.4289 1021.6557 1100.4632 1143.5639 1145.7094 1171.1576 1218.9292 1238.0102 1265.5742 1276.1182 1372.8739 1386.0779 1417.6676 1436.2373 1441.2121 1512.5821 1555.7756 1571.0960 1591.1712 1625.1130 1642.1163 3121.3019 3134.0077 3135.1955 3152.9337 3162.9397 3167.6377 3557.0659 3708.6521
redmass: 4.8639 6.8577 4.6698 4.1789 5.0637 2.4070 4.8466 1.5743 7.5990 1.9641 1.5382 7.1740 5.4673 3.7050 7.6030 3.5894 4.5679 5.2448 8.9483 6.7587 4.6468 6.8092 1.2733 2.5489 1.5234 5.2496 5.7870 1.7001 1.3397 1.4003 1.3341 2.9909 2.2485 2.2269 2.4151 1.2679 1.0919 1.8345 2.0715 2.7388 2.1619 3.2707 4.1615 3.0237 2.4435 5.3880 4.1958 6.7611 3.6203 2.1762 3.4605 4.0139 1.0860 1.0891 1.0882 1.0951 1.0968 1.0992 1.0451 1.1047
irintensity: 5.4567 0.0606 3.1864 9.4668 2.0000 21.4031 5.6094 58.0143 0.2906 70.2914 187.9470 0.7513 5.8303 0.2219 1.3482 0.0521 14.3711 12.3952 0.8134 11.1804 18.5066 1.3317 18.0345 30.0095 73.0155 6.7653 25.4055 3.8454 0.0259 5.1464 0.1083 8.3251 9.8190 3.1848 19.5277 0.5169 0.9192 11.2591 6.7667 87.0246 9.3681 63.7595 6.2485 0.1269 5.8413 13.8764 21.7978 8.1300 84.4086 12.2516 232.1818 413.5709 1.0492 3.7497 15.7524 27.2632 17.0081 23.2304 152.7725 50.1402
temp: 298.150 k
press: 1.00000 atm
elementType: 16 7 7 6 6 6 6 6 6 6 6 6 6 6 1 1 1 1 1 1 1 1
symmnumber: 1
zpe: 427922.5 jmol-1
zpe.correction: 0.162987 hartree
zpe.thermalcorrener: 0.173845 hartree
zpe.thermalcorrenthalpy: 0.174789 hartree
zpe.thermalcorrgfe: 0.126628 hartree
zpe.sumelectzpe: -930.608415 hartree
zpe.sumelectthermal: -930.597557 hartree
zpe.sumelectthermalent: -930.596613 hartree
zpe.sumelectthermalfe: -930.644774 hartree
dipole: 2.3033 -0.5630 0.0000
dipole: 2.3711
quadrupole: -63.7247 -76.5560 -94.9947
quadrupole: -8.5154 0.0004 -0.0007
quadrupole: 14.7004 1.8691 -16.5696 -8.5154 0.0004 -0.0007
hfenergy: -930.7714021 hartree
pointgroup: C01 [X(C11H8N2S1)]
dipole: 0.9143429 0.1849566 -0.0000002 debye
dipolederiv: -0.4185864 0.1089099 -0.0000188 -0.0712248 -0.4552658 0.0000433 -0.0000127 0.000076 0.0558174 -1.5650455 -0.1883365 0.0000383 0.0939784 -0.5589298 0.000017 0.0000699 0.0000247 -0.2249044 -1.4629695 -0.6089751 0.0001285 -0.8915637 -0.6765687 0.0000124 0.0001795 0.0000138 -0.7041615 0.0554798 -0.1718129 -0.0000041 -0.0485687 -0.0194387 0.0000016 0.0000057 0.0000072 0.0110096 0.5031396 0.2327202 -0.0000322 0.6381675 0.2515335 -0.0000235 -0.0001056 -0.0000315 0.0430097 0.0148295 -0.0771654 0.0000002 -0.198092 -0.0389363 0.0000106 -0.0000103 0.0000089 0.0557197 0.5874562 0.040003 0.0000455 -0.2576301 -0.2383837 0.000026 0.0000422 -0.0000319 -0.1099903 -0.1207989 0.0015161 0.000003 -0.0454441 0.0383247 -0.0000018 -0.0000157 0.000009 -0.206928 -0.0248852 0.0322186 -0.0000168 0.2091272 0.1490924 -0.0000114 0.0000236 -0.0000147 -0.1227696 -0.0756749 0.0903806 0.0000037 -0.0012337 0.0126086 0.0000024 0.0000087 0.0000045 -0.1434188 0.0567081 0.0576167 0. 0.1413005 0.0549036 0.0000003 0.0000048 -0.0000031 -0.1811681 -0.0808168 -0.060046 -0.0000023 0.0290933 0.1312286 0. -0.0000077 0.0000046 -0.1703926 1.9493612 0.4966016 -0.0001316 0.3081694 1.1924934 -0.0001224 -0.0000974 -0.0000877 0.0962172 0.0988092 0.04465 -0.0000018 0.0231799 -0.0675902 0.0000006 0.0000039 -0.0000002 -0.1653739 -0.0149893 -0.1222955 0.0000035 -0.0521486 -0.0337209 0. 0.0000075 0.0000003 0.164301 0.0608504 0.08662 -0.000001 0.036775 -0.0469742 -0.0000005 -0.0000109 0.0000131 0.1650945 0.0697575 -0.0960676 -0.0000018 -0.0462082 0.0078054 -0.0000012 -0.0000024 0.0000012 0.156319 0.0067587 -0.0549737 0.0000018 -0.1343693 -0.0532757 -0.0000008 -0.0000004 -0.0000036 0.156304 0.0340811 0.0826598 0.000003 0.1012786 -0.1036465 -0.0000039 0.0000043 -0.0000064 0.1592816 -0.1595323 0.0322413 0.000004 0.034677 0.086305 -0.0000004 0.0000009 0.0000013 0.1620353 0.3150254 0.0543127 -0.0000155 0.0193787 0.1390533 0.0000372 -0.000077 0.0000109 0.4028021 0.171042 0.0192221 -0.0000057 0.1113578 0.229382 0.0000144 -0.0000107 0.0000038 0.4011962 unknown
polarizability: 244.4695003|-4.6363028|166.6061395|-0.0040678|-0.001886|55.4623823 unknown
InChI: InChI=1S/C11H8N2S/c12-11-13-10-8-4-2-1-3-7(8)5-6-9(10)14-11/h1-6H,12H2
charge 0 multiplicity 1
22 atoms
S  3.041546 -1.145909 0.00012
N  1.656603 1.18198 0.000005
N  4.028473 1.48069 -0.000162
C  -0.717542 0.355151 0.000107
C  0.704255 0.146645 0.000086
C  -1.579003 -0.809245 0.000097
C  1.219284 -1.174534 0.000035
C  -1.005135 -2.127569 0.000071
C  0.380074 -2.320024 0.00003
C  -1.294084 1.664408 0.000118
C  -2.99894 -0.608228 0.000123
C  -2.68274 1.823898 0.00013
C  2.889816 0.7125 -0.000062
C  -3.541848 0.679331 0.00014
H  -1.674704 -2.995098 0.000088
H  0.803891 -3.328497 0.000046
H  -0.620135 2.526707 0.000121
H  -3.656131 -1.486213 0.000121
H  -3.120099 2.82838 0.000145
H  -4.628588 0.818372 0.000151
H  4.955791 1.067766 -0.000039
H  3.923715 2.492989 -0.000272
