program: Gaussian 09
title: 000094859
version: EM64L-G09RevD.01
frameworkgroup: C1[X(C13H12N2O2)]
method: RPBEPBE
basis: SDD
operation: Freq
keyword: #p
keyword: freq=noraman
keyword: PBEPBE/SDD
title: #p freq=noraman PBEPBE/SDD
converged: YES YES NO NO
title: Mulliken charges:
elementType: O O N N C C C C C C C C C C C C C H H H H H H H H H H H H
charge: -0.231921 -0.230331 -0.504025 0.017191 0.453075 0.480597 0.441508 -0.436138 -0.379701 -0.362099 -0.382063 -0.419118 -0.354253 0.383208 -0.347876 -0.370501 -0.804824 0.305681 0.234012 0.268246 0.234498 0.235321 0.232383 0.275021 0.285402 0.284192 0.228130 0.226221 0.238165
chargesum: 0.00000
title: Mulliken charges with hydrogens summed into heavy atoms:
elementType: O O N N C C C C C C C C C C C C C
charge: -0.231921 -0.230331 -0.198344 0.017191 0.453075 0.480597 0.441508 -0.202126 -0.111455 -0.127601 -0.146743 -0.186734 -0.079232 0.383208 -0.062474 -0.086309 -0.112308
polarizability: 3.66855258e+02 5.99209642e+00 1.58561493e+02 -7.52308098e+00 -1.32173497e+00 8.06796616e+01
1716.lowfreq: -25.2184 0.0001 0.0004 0.0006 2.9806 4.2147 11.1208 34.6618 41.0711
frequency: -24.8528 34.6586 41.0601 61.9822 85.7337 120.9684 145.1748 201.8323 239.5486 275.4973 310.5138 323.5465 371.4245 407.7056 417.4786 421.9127 484.8179 492.2936 509.8015 551.9536 553.6421 622.0188 628.0051 655.5754 664.7318 707.7164 726.2466 760.5935 773.5641 808.6105 821.4451 829.0589 835.8348 857.6015 871.6422 945.0546 966.4479 979.5319 987.9416 992.0076 995.3158 1007.2256 1047.0654 1099.6167 1116.9428 1129.8725 1180.5072 1192.0643 1225.7813 1228.3275 1233.8518 1270.8880 1309.4704 1320.1667 1346.9069 1362.5443 1389.7637 1399.3465 1418.5809 1448.1817 1470.6875 1473.5307 1489.7813 1505.2536 1520.1113 1584.5128 1595.8680 1615.9376 1629.2014 2975.6319 3056.8704 3086.3901 3117.5236 3127.9042 3128.6766 3141.8296 3162.1569 3169.7569 3183.0257 3187.6919 3529.5524
redmass: 1.0265 4.9865 5.2411 6.0362 5.1793 5.7129 4.6985 6.8889 5.3838 5.8023 4.7484 3.1461 3.2570 3.0646 5.2556 3.0882 2.5262 2.6015 5.6318 4.8041 1.5882 6.8014 6.6232 6.7843 5.1323 3.3967 4.8936 4.0927 6.7794 2.5804 1.3134 1.9189 1.5741 1.4899 4.7985 1.3156 1.3620 1.3251 1.4064 2.4060 1.4741 2.8188 1.5484 3.1136 1.3085 1.2825 1.4289 1.1498 2.7221 3.3105 4.3520 1.4393 1.3928 1.7110 6.1379 4.0992 6.0306 1.2198 3.5371 4.2183 1.1643 1.0531 2.1661 2.3266 3.0218 7.3953 3.7508 6.4173 6.4398 1.0390 1.0947 1.0998 1.0875 1.0894 1.0904 1.0967 1.0945 1.0890 1.0945 1.0967 1.0754
irintensity: 0.4981 0.6796 0.2819 0.8807 0.9225 2.4083 3.4190 0.8908 0.1168 3.8514 2.4732 3.8052 3.3213 0.6931 0.9889 1.4282 46.9059 70.2169 5.3473 7.7096 55.9427 0.1142 3.3456 6.9647 21.6222 0.9076 7.1983 3.2035 5.6383 19.4523 4.0760 95.6332 7.3776 27.0547 2.3790 2.5318 1.3842 2.1265 0.6491 0.9450 0.9329 2.8433 25.3149 11.4814 13.6297 25.1761 327.2647 34.2923 0.6612 188.4359 526.6748 6.5063 2.9055 49.6433 86.8173 125.3008 49.9571 9.2460 5.2833 3.7195 18.7743 13.6298 20.2568 36.9525 377.1073 9.2936 29.1351 443.4221 55.7450 45.6669 21.5459 17.1590 16.0198 21.4243 10.1069 24.7608 4.8333 1.3412 1.0345 3.9048 43.3085
temp: 298.150 k
press: 1.00000 atm
elementType: 8 8 7 7 6 6 6 6 6 6 6 6 6 6 6 6 6 1 1 1 1 1 1 1 1 1 1 1 1
symmnumber: 1
zpe: 585927.9 jmol-1
zpe.correction: 0.223168 hartree
zpe.thermalcorrener: 0.237160 hartree
zpe.thermalcorrenthalpy: 0.238104 hartree
zpe.thermalcorrgfe: 0.180946 hartree
zpe.sumelectzpe: -761.264822 hartree
zpe.sumelectthermal: -761.250830 hartree
zpe.sumelectthermalent: -761.249886 hartree
zpe.sumelectthermalfe: -761.307045 hartree
dipole: 8.6079 2.7550 0.2435
dipole: 9.0413
quadrupole: -127.2766 -88.8889 -101.3313
quadrupole: -9.4695 -2.2611 -2.0786
quadrupole: -21.4444 16.9434 4.5010 -9.4695 -2.2611 -2.0786
hfenergy: -761.4879901 hartree
pointgroup: C01 [X(C13H12N2O2)]
dipole: -3.4024442 1.0326264 -0.1011349 debye
polarizability: 367.0413883|-2.7579743|158.4064933|-6.512144|1.7350419|80.6485311 unknown
InChI: InChI=1S/C13H12N2O2/c1-10-2-4-11(5-3-10)14-12-6-8-13(9-7-12)15(16)17/h2-9,14H,1H3
charge 0 multiplicity 1
29 atoms
O  5.571422 0.29107 -0.179224
O  4.849032 -1.803729 0.38422
N  -0.739336 1.318454 -0.06109
N  4.629179 -0.560497 0.08642
C  -1.982273 0.622146 -0.039493
C  0.561188 0.808302 -0.031792
C  -4.556167 -0.64245 -0.035481
C  -3.100421 1.255154 0.56547
C  -2.163144 -0.64452 -0.655003
C  -4.363982 0.63149 0.559492
C  -3.430867 -1.261774 -0.637947
C  1.642708 1.69671 -0.332678
C  0.862527 -0.542718 0.325828
C  3.241976 -0.091478 0.049094
C  2.970108 1.256156 -0.291923
C  2.191702 -0.985935 0.365534
C  -5.923196 -1.302812 -0.056318
H  -0.811863 2.338035 -0.082227
H  -2.972998 2.228454 1.055379
H  -1.331288 -1.129462 -1.174181
H  -5.212266 1.13745 1.035807
H  -3.549814 -2.239868 -1.1195
H  1.425042 2.735748 -0.608225
H  0.059432 -1.225981 0.610536
H  3.802796 1.92477 -0.524958
H  2.437146 -2.012637 0.650193
H  -5.841579 -2.403914 -0.056129
H  -6.530097 -1.006581 0.817366
H  -6.491667 -1.016484 -0.962771
