program: Gaussian 09
title: 000094830
version: EM64L-G09RevD.01
frameworkgroup: C1[X(C6H3Cl2NO2)]
method: RPBEPBE
basis: SDD
operation: Freq
keyword: #p
keyword: freq=noraman
keyword: PBEPBE/SDD
title: #p freq=noraman PBEPBE/SDD
converged: NO YES NO NO
title: Mulliken charges:
elementType: Cl Cl O O N C C C C C C H H H
charge: 0.007187 0.010090 -0.428368 -0.225096 0.169369 0.305776 -0.202275 -0.213273 -0.282513 -0.281105 0.143970 0.300060 0.297926 0.398251
chargesum: 0.00000
title: Mulliken charges with hydrogens summed into heavy atoms:
elementType: Cl Cl O O N C C C C C C
charge: 0.007187 0.010090 -0.030117 -0.225096 0.169369 0.305776 0.097785 0.084653 -0.282513 -0.281105 0.143970
polarizability: 1.22260649e+02 -4.92569600e-01 1.33469512e+02 -1.12149906e-02 3.05129931e-03 3.57465431e+01
1716.lowfreq: 0.0024 0.0027 0.0033 5.7839 7.6091 8.4182 57.5898 116.2070 140.3443
frequency: 57.5487 116.2014 140.3426 174.1156 179.7644 196.6200 320.2776 333.5219 386.4829 433.4886 474.5445 527.4851 568.6789 601.6408 624.8809 712.8686 739.3929 769.7387 815.8680 916.0056 922.7208 942.2509 1044.2863 1085.4312 1154.6711 1179.5899 1315.5885 1328.3551 1350.6124 1384.2442 1540.7393 1564.6856 1645.5270 3193.4159 3207.8198 3521.4586
redmass: 12.1467 9.9011 11.0240 4.3391 22.4637 8.5786 9.9312 17.4083 11.0103 11.8243 4.3396 5.9592 6.0991 4.8610 1.2928 6.0635 3.6532 10.6050 9.1649 1.4607 1.4253 7.1844 3.1375 1.6406 1.6367 3.2017 2.3996 6.6421 3.4456 4.4068 10.2516 6.4586 9.4856 1.0943 1.0947 1.0644
irintensity: 1.4670 0.1318 0.8115 0.0025 0.0441 1.8630 0.0591 1.4519 8.0129 11.5052 19.2462 15.7857 0.8556 69.5718 135.4936 4.5187 45.3018 160.5784 19.8499 18.6362 15.3024 2.6747 179.8691 17.4159 77.9094 115.5618 121.6308 83.9724 129.4328 42.6644 251.3759 36.9749 183.1664 5.8441 5.4035 60.0426
temp: 298.150 k
press: 1.00000 atm
elementType: 17 17 8 8 7 6 6 6 6 6 6 1 1 1
symmnumber: 1
zpe: 212162.9 jmol-1
zpe.correction: 0.080809 hartree
zpe.thermalcorrener: 0.090552 hartree
zpe.thermalcorrenthalpy: 0.091496 hartree
zpe.thermalcorrgfe: 0.044138 hartree
zpe.sumelectzpe: -1354.975195 hartree
zpe.sumelectthermal: -1354.965452 hartree
zpe.sumelectthermalent: -1354.964507 hartree
zpe.sumelectthermalfe: -1355.011865 hartree
dipole: -3.5580 1.1442 0.0008
dipole: 3.7374
quadrupole: -75.0334 -79.1640 -76.1249
quadrupole: -7.4103 0.0010 -0.0007
quadrupole: 1.7407 -2.3899 0.6492 -7.4103 0.0010 -0.0007
hfenergy: -1355.0560031 hartree
pointgroup: C01 [X(C6H3Cl2N1O2)]
dipole: -1.3727694 0.5268982 0.0003182 debye
dipolederiv: -0.3040723 -0.3860284 0.0000327 -0.3374366 -0.7302214 0.0000422 0.0000652 0.0001057 -0.0597978 -0.3230725 0.3972944 0.0000569 0.3470663 -0.6985817 -0.0000772 0.0000562 -0.0000882 -0.0574345 -0.7033495 0.4518215 0.0000876 0.5182899 -0.9317591 -0.0000803 -0.0000385 0.0001682 -0.4178569 -0.874834 -0.2645721 0.0000903 -0.0953147 -0.7774816 0.0001078 -0.000089 -0.0001981 -0.3139495 -0.3487245 0.0153784 0.0000537 0.0135005 -1.173669 -0.0000101 0.0000641 -0.000051 -0.1009262 -0.3703851 0.0108537 0.0000034 -0.0206194 0.3833527 0.0000098 0.0001413 0.0000215 0.0409552 -0.2796919 -0.4472574 0.0000216 -0.0284905 -0.4052092 -0.0000062 0.0001154 0.0000877 -0.043433 -0.3245881 0.4465977 0.000067 0.0208328 -0.3774284 -0.0000299 0.0001029 -0.0001038 -0.040158 0.6291035 0.6778864 -0.0001054 0.5585851 1.4706463 -0.0000616 -0.0001565 -0.000136 -0.0005486 0.6913836 -0.7091794 -0.0001756 -0.5815075 1.4236789 0.0001247 -0.0001845 0.000185 -0.0019758 1.7463547 -0.088728 -0.0001122 -0.2532403 1.3632579 -0.0000087 -0.0000202 0.0000155 0.24112 0.1282068 0.0321792 0.000013 0.029617 0.0764553 -0.0000101 0.0000092 -0.0000059 0.1716928 0.1262494 -0.0451201 0.0000119 -0.0166777 0.078575 0.0000013 0.0000152 0.0000029 0.1700368 0.2074199 -0.0911261 -0.000045 -0.1546048 0.2983844 -0.0000017 -0.0000807 -0.0000034 0.4122754 unknown
polarizability: 122.2405378|0.1296179|133.4896224|-0.011029|0.0036671|35.7465431 unknown
InChI: InChI=1S/C6H3Cl2NO2/c7-4-1-3(6(10)11)2-5(8)9-4/h1-2,10H
charge 0 multiplicity 1
14 atoms
Cl 2.232725 2.722707 -0.000275
Cl 2.320918 -2.661989 -0.000458
O  -2.880499 1.169893 0.000267
O  -2.956262 -1.155955 0.00005
N  2.014489 0.026217 -0.000339
C  -0.794735 -0.019208 0.000314
C  -0.108391 1.220253 0.000209
C  -0.066698 -1.23522 0.000092
C  1.300897 1.164522 -0.00007
C  1.338881 -1.135955 -0.000245
C  -2.290474 -0.096014 0.000541
H  -0.651558 2.166074 0.000354
H  -0.586533 -2.19558 0.000163
H  -3.871959 1.078354 -0.000002
