program: Gaussian 09
title: 000094827
version: EM64L-G09RevD.01
frameworkgroup: C1[X(C11H11NO4)]
method: RPBEPBE
basis: SDD
operation: Freq
keyword: #p
keyword: freq=noraman
keyword: PBEPBE/SDD
title: #p freq=noraman PBEPBE/SDD
converged: YES YES NO NO
title: Mulliken charges:
elementType: O O O O N C C C C C C C C C C C H H H H H H H H H H H
charge: -0.276050 -0.250546 -0.201139 -0.199143 0.023239 0.524161 -0.507460 0.368893 -0.377892 -0.255543 -0.360662 -0.197012 -0.344791 -0.228403 0.230560 -0.672085 0.294296 0.241720 0.269683 0.291418 0.242895 0.247387 0.231603 0.230643 0.213788 0.230233 0.230208
chargesum: 0.00000
title: Mulliken charges with hydrogens summed into heavy atoms:
elementType: O O O O N C C C C C C C C C C C
charge: -0.276050 -0.250546 -0.201139 -0.199143 0.023239 0.524161 -0.213164 0.368893 -0.136172 0.014140 -0.069244 0.045884 -0.097404 0.233843 0.230560 0.002143
polarizability: 2.79790102e+02 -3.80390110e+00 1.47168891e+02 -3.87226427e-01 -9.38729469e-02 6.43703221e+01
1716.lowfreq: -12.2714 -1.4730 -0.0003 0.0007 0.0009 4.2102 13.2370 45.3621 51.3007
frequency: 9.5333 45.1993 51.2834 54.9833 74.1998 107.4076 134.5182 168.4590 197.1726 209.3793 223.4842 258.8167 285.9980 305.4207 355.4096 388.5870 425.9829 474.0260 514.6995 535.5271 571.8669 656.2993 656.9301 695.3331 712.4468 714.0858 769.1329 796.5954 821.0218 826.7049 890.0185 904.7847 939.4476 950.9243 959.6309 988.0038 1002.2511 1017.5002 1027.7787 1087.4087 1090.5370 1112.0311 1132.1060 1135.8103 1180.4857 1207.6230 1227.3721 1248.2303 1293.0173 1296.4347 1317.4492 1357.2654 1375.0976 1396.1074 1400.6883 1437.3431 1463.9047 1472.6586 1481.2597 1486.0719 1578.9143 1606.7192 1616.5653 1652.7405 2996.1545 3008.5961 3066.6451 3092.9291 3106.7094 3107.3135 3146.4740 3158.4195 3165.7407 3167.9664 3188.7488
redmass: 3.5832 4.2829 5.8402 6.6852 3.4606 3.6751 5.8912 4.8440 1.8272 6.2517 6.3749 1.4589 3.2909 6.4852 4.0472 7.0377 3.2101 5.7136 4.1885 5.1764 7.2161 8.1288 4.1006 2.2662 7.8854 7.9482 6.9775 1.1018 1.5190 3.9934 1.8800 4.1225 1.4846 1.4369 5.1715 6.1592 1.3616 1.1926 2.5123 1.5838 1.9656 2.3209 2.8642 1.4860 1.2224 2.3777 3.4002 1.1330 1.4480 2.1743 1.2951 1.4367 10.7400 4.5466 1.3152 3.3531 1.0403 1.0626 2.6106 1.0779 6.2332 10.2131 7.4465 5.8050 1.0358 1.0581 1.1065 1.0986 1.0904 1.1025 1.0879 1.0918 1.0933 1.0933 1.0966
irintensity: 0.0169 0.0178 0.1888 0.5458 0.9867 2.7824 3.3505 0.4078 1.7410 0.7920 5.5686 1.0130 1.8790 9.0728 6.6331 1.5948 0.5748 0.8294 7.1530 1.7901 18.8073 14.0557 7.2695 30.5621 7.7423 22.9119 3.6446 4.8120 37.6816 3.6029 18.2864 15.1203 0.0194 6.1999 33.4716 1.4039 0.5761 57.3228 107.3571 35.9445 48.8597 47.4829 452.5063 14.2126 80.9149 140.3072 77.4709 0.0078 89.0108 116.9653 10.1310 0.5400 94.6858 41.7349 14.7615 30.0382 12.2509 5.9575 29.8931 17.4972 0.2689 173.7276 49.6276 94.5650 24.7304 18.1965 8.6346 30.6419 0.8870 44.1871 7.0580 3.5463 7.0975 9.4439 5.3873
temp: 298.150 k
press: 1.00000 atm
elementType: 8 8 8 8 7 6 6 6 6 6 6 6 6 6 6 6 1 1 1 1 1 1 1 1 1 1 1
symmnumber: 1
zpe: 529828.3 jmol-1
zpe.correction: 0.201801 hartree
zpe.thermalcorrener: 0.217179 hartree
zpe.thermalcorrenthalpy: 0.218123 hartree
zpe.thermalcorrgfe: 0.155909 hartree
zpe.sumelectzpe: -780.164654 hartree
zpe.sumelectthermal: -780.149277 hartree
zpe.sumelectthermalent: -780.148333 hartree
zpe.sumelectthermalfe: -780.210546 hartree
dipole: 4.2601 4.7014 -0.0041
dipole: 6.3444
quadrupole: -101.4175 -93.4148 -93.7550
quadrupole: -8.4855 0.2308 -0.0788
quadrupole: -5.2217 2.7810 2.4407 -8.4855 0.2308 -0.0788
hfenergy: -780.3664553 hartree
pointgroup: C01 [X(C11H11N1O4)]
dipole: 1.6565681 1.8637687 0.1117312 debye
polarizability: 279.7237029|-2.6445756|147.0025051|5.2131749|2.9145355|64.603107 unknown
InChI: InChI=1S/C11H11NO4/c1-2-16-11(13)7-6-9-4-3-5-10(8-9)12(14)15/h3-8H,2H2,1H3
charge 0 multiplicity 1
27 atoms
O  4.24187 0.297719 0.113776
O  3.221766 -1.805077 -0.011481
O  -5.446268 -0.278174 -0.14204
O  -4.095771 -2.115568 -0.172076
N  -4.284172 -0.839572 -0.1350
C  -0.654391 0.273522 -0.020432
C  -1.809491 -0.551323 -0.073113
C  -3.086484 0.041522 -0.080415
C  -0.834191 1.688517 0.023058
C  0.666881 -0.372798 -0.01308
C  -3.271738 1.439334 -0.037593
C  -2.122392 2.258551 0.014417
C  1.883622 0.246141 0.041517
C  5.575878 -0.376377 0.124017
C  3.130353 -0.55178 0.042029
C  6.625499 0.72228 0.251505
H  -1.726015 -1.642005 -0.107578
H  0.040206 2.346143 0.063425
H  0.677714 -1.471742 -0.054985
H  -4.283529 1.852315 -0.04553
H  -2.236665 3.346572 0.048046
H  2.007653 1.33263 0.087912
H  5.598418 -1.087533 0.969733
H  5.67761 -0.955396 -0.811983
H  7.635616 0.273922 0.262178
H  6.567138 1.425353 -0.596916
H  6.488783 1.291724 1.186607
