program: Gaussian 09
title: 000094817
version: EM64L-G09RevD.01
frameworkgroup: C1[X(C7H15NO2)]
method: RPBEPBE
basis: SDD
operation: Freq
keyword: #p
keyword: freq=noraman
keyword: PBEPBE/SDD
title: #p freq=noraman PBEPBE/SDD
converged: YES YES NO NO
title: Mulliken charges:
elementType: O O N C C C C C C C H H H H H H H H H H H H H H H
charge: -0.413249 -0.242596 -0.651383 -0.365091 -0.015771 -0.375834 -0.167545 -0.710750 -0.716465 0.146932 0.196872 0.221039 0.186801 0.213073 0.212262 0.248820 0.209555 0.208824 0.212091 0.208546 0.209894 0.212253 0.314353 0.277097 0.380272
chargesum: 0.00000
title: Mulliken charges with hydrogens summed into heavy atoms:
elementType: O O N C C C C C C C
charge: -0.032976 -0.242596 -0.059933 0.052820 0.171030 0.049501 0.081275 -0.080280 -0.085773 0.146932
polarizability: 9.52116931e+01 3.07518624e+00 8.78757982e+01 -3.99020052e+00 3.69439689e-01 8.25838801e+01
1716.lowfreq: -10.5225 -7.6968 -0.0009 -0.0009 0.0008 11.2439 25.5583 40.0257 60.4223
frequency: 25.2486 39.8453 60.3357 102.1816 146.6473 165.1630 194.7620 202.7993 231.1878 274.8036 319.8180 360.0784 385.6022 426.1364 452.1022 476.2946 518.0135 565.7576 623.4572 709.2699 764.1888 785.3955 839.3950 903.9099 909.8977 946.4485 954.5141 974.5044 1045.5642 1063.0231 1086.1187 1125.7004 1148.2973 1175.0733 1186.0679 1215.8104 1225.0068 1267.9555 1285.6047 1294.6597 1328.3506 1333.0834 1360.0758 1371.6237 1381.5147 1390.5370 1451.9150 1464.6427 1467.4813 1475.7960 1479.7948 1488.7678 1605.0885 1662.3453 2894.2562 2950.9892 2958.4124 2965.2379 2970.2279 2992.1501 3021.6558 3055.5742 3058.0788 3065.1842 3067.1113 3070.7896 3503.6566 3518.0853 3649.1688
redmass: 2.7306 6.2714 3.8353 2.3921 2.4517 1.2045 1.2110 2.0914 1.1778 3.9647 2.9390 2.4011 2.4086 2.2493 3.6364 1.5018 2.0302 2.9635 1.5053 4.2654 1.3067 3.0854 2.6994 1.9943 1.1857 1.4126 1.9095 1.8170 2.8283 1.8979 1.7960 2.1494 1.4109 1.7559 1.9288 1.5925 1.5198 1.5833 1.2093 1.2893 1.4740 1.3979 1.5051 1.2776 1.6867 1.2172 1.0950 1.0669 1.0448 1.0785 1.0549 1.0507 1.3668 3.4484 1.0806 1.0831 1.0604 1.0356 1.0365 1.0593 1.0978 1.1033 1.0997 1.0999 1.0988 1.0984 1.0460 1.0641 1.0995
irintensity: 0.0450 2.5356 0.3609 0.4451 1.0149 25.9832 0.5874 0.7824 0.2100 2.1916 6.8382 2.4448 0.3175 3.0679 27.7984 165.4171 70.2997 5.0773 184.0855 20.6274 15.3687 3.7478 0.4399 3.0802 2.7084 1.1479 3.8635 1.5207 195.9983 65.2219 17.1474 4.2705 9.3643 8.2326 6.4242 5.8604 4.9856 11.6721 1.3055 4.7713 9.6738 1.3824 3.8300 23.4584 3.5429 12.1836 2.7600 0.8244 3.0447 5.3890 7.9033 25.8676 181.7755 128.0865 51.0124 23.2652 24.9828 44.9455 21.6901 42.8015 7.1740 20.3471 15.2362 57.1929 97.3121 60.2112 13.1573 26.6410 17.6397
temp: 298.150 k
press: 1.00000 atm
elementType: 8 8 7 6 6 6 6 6 6 6 1 1 1 1 1 1 1 1 1 1 1 1 1 1 1
symmnumber: 1
zpe: 565105.3 jmol-1
zpe.correction: 0.215237 hartree
zpe.thermalcorrener: 0.228021 hartree
zpe.thermalcorrenthalpy: 0.228965 hartree
zpe.thermalcorrgfe: 0.175190 hartree
zpe.sumelectzpe: -480.116164 hartree
zpe.sumelectthermal: -480.103380 hartree
zpe.sumelectthermalent: -480.102436 hartree
zpe.sumelectthermalfe: -480.156210 hartree
dipole: -0.2684 0.4476 -1.6037
dipole: 1.6865
quadrupole: -63.2892 -54.5744 -66.1754
quadrupole: -0.6138 3.6699 1.1000
quadrupole: -1.9429 6.7720 -4.8291 -0.6138 3.6699 1.1000
hfenergy: -480.3314008 hartree
pointgroup: C01 [X(C7H15N1O2)]
dipole: -0.1062702 0.1797794 -0.629801 debye
dipolederiv: -0.4079148 -0.0013041 -0.1081724 -0.0097201 -0.7473126 -0.5024962 -0.1044799 -0.4401327 -0.7453346 -0.534704 -0.0530863 0.2913607 -0.2302526 -0.5409107 0.0975398 0.2789196 -0.1215116 -0.8411114 -0.7919242 0.0745007 -0.1377967 0.1259168 -0.4379838 -0.2237692 -0.080932 -0.183656 -0.545734 -0.0682776 0.0495812 0.0035384 0.0728622 0.0782744 0.0377976 0.0637873 0.0273133 0.0284817 0.1508627 -0.0025894 -0.006843 0.0143216 0.1480225 0.0241932 -0.0643759 0.0317123 0.164787 0.0377565 0.1257594 0.0185743 0.0104764 0.0591643 0.0457226 -0.0143643 -0.0474916 0.0889351 0.2178782 -0.2625384 0.0431123 -0.2503894 0.1722199 0.2444376 0.1532839 0.3544633 0.3549092 -0.0223661 -0.0508314 0.0007119 -0.0486354 -0.0617496 0.0336872 0.0288106 0.0478879 0.072116 -0.019899 0.0373672 -0.0437488 0.0340004 0.0000591 0.0799304 -0.0211116 0.0572348 0.038394 0.5780808 0.2343836 -0.3241335 0.4763123 1.0169017 0.247701 -0.3752581 0.3214546 1.2191233 -0.019182 -0.0946013 0.0253011 -0.1080351 -0.137938 0.0648572 0.024719 0.0503189 0.0416731 0.0877216 -0.0197189 -0.013616 -0.0210534 0.0407972 -0.0870011 -0.0240978 -0.0613113 -0.0826367 0.0244233 -0.0093071 -0.0259676 -0.0102088 -0.0288439 -0.0877873 0.0092996 -0.0968271 -0.1726185 0.0143751 -0.0911331 0.0465817 -0.0698485 -0.1180426 0.0799333 0.0209217 0.0693135 0.0446921 0.0434417 0.025351 -0.0097594 0.0231448 0.009319 -0.120994 -0.0238739 -0.0752124 -0.0988985 -0.0580439 0.0359077 -0.1010239 0.03886 0.0046484 0.0313508 -0.1200667 -0.0103637 -0.1343686 -0.2132784 -0.0020638 0.0719005 0.049063 0.0742164 -0.0203722 0.0575875 -0.0102781 0.0789603 0.0918644 0.0051848 0.0322518 -0.0187348 0.0159836 -0.0711152 -0.0140006 -0.1304644 -0.1152449 0.0754963 0.0815851 -0.0966776 0.0666562 -0.052682 0.1099678 -0.0804245 0.1216806 -0.04193 0.0906121 0.0176538 0.0189716 -0.0002808 0.0273943 -0.1278346 -0.0242803 -0.0581335 -0.1320907 -0.2121492 0.0801474 0.0345426 0.0482717 0.0777228 0.0081842 0.0654237 -0.0063809 0.0589602 0.039724 -0.1374212 0.0074824 -0.0886539 -0.1440127 0.0425704 -0.0049716 0.0243247 0.0705472 0.2374775 0.0174531 0.1309459 -0.018753 0.2341281 0.0213949 0.0768551 -0.0237689 0.2147447 0.3499851 0.0274918 0.0633667 -0.006522 0.0697378 0.0186193 0.0438122 0.0511212 0.1691041 0.3080401 -0.0877719 0.0790968 -0.0787977 0.2408864 0.0534823 0.1288171 0.1087073 0.2645396 unknown
polarizability: 95.2189556|3.0670508|87.8470472|-4.0003831|0.4060273|82.6053686 unknown
InChI: InChI=1S/C7H15NO2/c1-5(2)3-4-6(8)7(9)10/h5-6,9H,3-4,8H2,1-2H3
charge 0 multiplicity 1
25 atoms
O  -2.122876 -1.315952 -1.045184
O  -2.71004 -0.599767 1.081369
N  -1.411739 1.809504 0.758162
C  0.925813 -0.120866 0.176369
C  2.408522 -0.323735 -0.237761
C  0.060097 0.5874 -0.884106
C  -1.389988 0.900359 -0.388542
C  3.170215 1.019461 -0.356286
C  3.121844 -1.255788 0.771104
C  -2.13309 -0.37809 -0.007271
H  0.484103 -1.115903 0.394935
H  0.880032 0.463815 1.116816
H  2.424126 -0.818811 -1.233174
H  0.512116 1.559084 -1.160632
H  -0.004136 -0.025697 -1.803625
H  -1.945089 1.305925 -1.268279
H  4.227782 0.849922 -0.632516
H  3.153847 1.557973 0.611031
H  2.728076 1.68355 -1.121082
H  3.118456 -0.807454 1.783645
H  4.175395 -1.430224 0.482514
H  2.618016 -2.238504 0.83626
H  -2.019381 1.524866 1.529423
H  -1.407625 2.805334 0.543952
H  -2.626076 -2.124904 -0.756822
