program: Gaussian 09
title: 000094795
version: EM64L-G09RevD.01
frameworkgroup: C1[X(C12H23NO2)]
method: RPBEPBE
basis: SDD
operation: Freq
keyword: #p
keyword: freq=noraman
keyword: PBEPBE/SDD
title: #p freq=noraman PBEPBE/SDD
converged: YES YES NO NO
title: Mulliken charges:
elementType: O O N C C C C C C C C C C C C H H H H H H H H H H H H H H H H H H H H H H H
charge: -0.245098 -0.284738 -0.151819 -0.383473 -0.366012 -0.537114 -0.372622 -0.365343 -0.372504 0.242985 -0.351792 -0.302429 -0.290841 -0.356708 -0.696502 0.216832 0.222723 0.183655 0.184271 0.228298 0.225618 0.192736 0.192282 0.265146 0.224269 0.234896 0.229551 0.186030 0.186024 0.223348 0.200471 0.191109 0.221000 0.195801 0.195793 0.209156 0.215789 0.209213
chargesum: 0.00000
title: Mulliken charges with hydrogens summed into heavy atoms:
elementType: O O N C C C C C C C C C C C C
charge: -0.245098 -0.284738 -0.151819 0.056082 0.001914 -0.083199 0.012396 0.124071 0.091943 0.242985 0.020262 0.121390 0.121268 0.034885 -0.062344
polarizability: 1.85954828e+02 3.04178675e+00 1.34773033e+02 -1.01090316e+00 -3.16523226e+00 1.09453589e+02
1716.lowfreq: -10.4134 -4.2675 -0.0006 0.0005 0.0008 7.6484 18.3988 42.0965 46.6074
frequency: 14.7180 42.0633 44.8775 50.7103 69.1461 93.7132 109.1615 119.7641 144.8780 151.1582 174.9961 199.8691 233.0280 258.4085 275.7466 325.3208 350.7384 393.9030 416.5049 431.4754 454.7726 509.4989 542.2301 562.3729 620.9072 720.2936 728.3726 756.8116 763.5263 794.8189 827.9120 832.9945 889.1076 894.6708 907.6424 933.3593 991.3459 999.2312 1011.3270 1019.1203 1035.3100 1049.9078 1059.1859 1070.5584 1080.1702 1084.4828 1098.1988 1108.3264 1121.6180 1182.4904 1187.9473 1191.3469 1201.8546 1224.9455 1229.3883 1257.4964 1265.5436 1270.5121 1273.3875 1278.0535 1289.1411 1292.1677 1305.9903 1325.2360 1338.4333 1341.1788 1352.2245 1354.4857 1357.5111 1365.3266 1390.8097 1410.5682 1443.8286 1446.2750 1452.2340 1454.1012 1460.2575 1461.1671 1462.6789 1467.2675 1474.7161 1477.6226 1482.5500 1488.1352 1583.6009 2944.0742 2945.0991 2950.5758 2956.6928 2958.5674 2959.0608 2968.5024 2969.8277 2971.2013 2980.8684 2983.5778 2992.1646 3001.0748 3005.4359 3014.2943 3034.2663 3064.7587 3067.8032 3070.1930 3080.0963 3081.6949 3089.4026 3096.5984
redmass: 3.5768 3.7911 1.8081 3.7162 4.5957 1.8631 2.5378 3.5933 1.8715 2.2098 4.4431 2.7747 1.1107 2.6183 2.9422 3.1187 5.1012 1.8839 3.4626 3.5036 2.8065 3.4754 2.6485 3.3714 2.3238 1.0651 1.1007 4.3069 1.1978 4.1905 1.3537 1.5696 1.8971 2.6174 1.2899 3.2191 1.1848 4.1044 2.3575 2.7216 3.0872 2.1915 2.8349 3.5815 2.1066 2.3795 1.5141 1.9033 2.6499 2.4571 1.6657 1.0948 1.5383 1.4061 1.3869 1.5640 1.3776 1.2531 1.2045 1.0379 1.0736 1.1408 1.3908 1.2472 1.4054 1.2945 1.3880 1.6179 1.6373 1.3085 1.2182 2.7139 1.1029 1.0830 1.0928 1.0910 1.0761 1.1146 1.0715 1.0771 1.0777 1.0423 1.0826 1.0889 8.0770 1.0683 1.0591 1.0589 1.0595 1.0680 1.0592 1.0582 1.0679 1.0372 1.0650 1.0973 1.1001 1.0618 1.0977 1.1034 1.1045 1.1034 1.1008 1.0993 1.0961 1.0957 1.0986 1.0923
irintensity: 0.1669 0.4640 0.4993 0.5588 2.7074 0.0071 0.8239 0.1208 0.0184 1.1053 2.6979 2.4877 0.0003 2.4266 17.6230 10.4679 0.9956 0.6213 5.1843 0.7412 0.1228 1.3556 7.1010 18.6908 4.0202 15.0086 0.0791 0.4049 4.8823 18.5984 0.1258 0.4291 3.0353 1.9465 3.0442 7.8796 0.1062 14.5309 10.2466 45.7028 1.2939 35.4281 1.1884 34.9288 0.9347 2.7862 1.5092 1.7730 6.2014 9.5180 0.4765 0.7165 84.4500 94.1553 0.4337 23.9537 29.0411 7.7357 12.3327 1.0648 0.3800 0.1800 6.6303 0.6971 8.2419 2.2774 2.0177 0.9409 0.2607 1.2531 11.1228 129.3530 21.5375 4.7384 17.2128 5.2696 0.5359 9.1849 0.8401 1.8033 1.9183 12.3907 4.5496 24.1747 246.0213 44.6534 10.3228 4.9818 15.9825 45.7549 32.9550 110.6611 43.4628 33.9501 69.9260 4.5111 2.2903 27.2422 12.3170 0.4564 74.9013 41.0221 123.0985 55.6754 40.3806 11.0614 35.9819 17.4261
temp: 298.150 k
press: 1.00000 atm
elementType: 8 8 7 6 6 6 6 6 6 6 6 6 6 6 6 1 1 1 1 1 1 1 1 1 1 1 1 1 1 1 1 1 1 1 1 1 1 1
symmnumber: 1
zpe: 881615.2 jmol-1
zpe.correction: 0.335790 hartree
zpe.thermalcorrener: 0.353112 hartree
zpe.thermalcorrenthalpy: 0.354056 hartree
zpe.thermalcorrgfe: 0.288082 hartree
zpe.sumelectzpe: -675.043242 hartree
zpe.sumelectthermal: -675.025919 hartree
zpe.sumelectthermalent: -675.024975 hartree
zpe.sumelectthermalfe: -675.090949 hartree
dipole: 0.3464 -2.8606 0.4833
dipole: 2.9217
quadrupole: -100.3373 -98.2875 -91.2788
quadrupole: -1.0442 -0.7826 -0.0015
quadrupole: -3.7027 -1.6530 5.3557 -1.0442 -0.7826 -0.0015
hfenergy: -675.3790313 hartree
pointgroup: C01 [X(C12H23N1O2)]
dipole: -0.130683 1.1235826 0.2045294 debye
polarizability: 185.9851837|2.7899879|134.6614753|0.9619302|3.4750643|109.5347906 unknown
InChI: InChI=1S/C12H23NO2/c1-2-3-4-5-6-7-12(14)13-8-10-15-11-9-13/h2-11H2,1H3
charge 0 multiplicity 1
38 atoms
O  5.204533 0.943083 -0.309992
O  1.268973 -2.016478 -0.149674
N  2.644466 -0.209611 0.331558
C  -1.164418 -0.604792 0.041725
C  -2.384764 0.340287 0.095869
C  0.167183 0.152343 0.214437
C  -3.730488 -0.403165 -0.061205
C  3.85645 -1.059188 0.285931
C  2.921926 1.206371 0.645692
C  1.387353 -0.778486 0.116995
C  -4.95677 0.536338 -0.021515
C  4.885982 -0.451138 -0.682278
C  3.983652 1.761075 -0.330899
C  -6.303108 -0.208106 -0.172959
C  -7.522728 0.738288 -0.138999
H  -1.248196 -1.378847 0.827814
H  -1.148798 -1.152974 -0.91857
H  -2.297096 1.106539 -0.703793
H  -2.386428 0.894836 1.058542
H  0.173711 0.676051 1.192579
H  0.245293 0.943885 -0.560096
H  -3.7287 -0.963928 -1.01912
H  -3.82421 -1.163546 0.742011
H  3.545404 -2.068377 -0.032495
H  4.297225 -1.122307 1.301505
H  2.00245 1.807915 0.576027
H  3.310971 1.284519 1.682231
H  -4.957613 1.100777 0.934844
H  -4.86599 1.293845 -0.82843
H  5.845434 -0.991256 -0.634971
H  4.492775 -0.479318 -1.721257
H  3.564764 1.789487 -1.361031
H  4.301841 2.774122 -0.033415
H  -6.299637 -0.775387 -1.126161
H  -6.395051 -0.961829 0.635669
H  -7.565645 1.295247 0.816242
H  -8.47187 0.181873 -0.248468
H  -7.470075 1.481352 -0.957242
