program: Gaussian 09
title: 000094762
version: EM64L-G09RevD.01
frameworkgroup: C1[X(C5H10N2O2)]
method: RPBEPBE
basis: SDD
operation: Freq
keyword: #p
keyword: freq=noraman
keyword: PBEPBE/SDD
title: #p freq=noraman PBEPBE/SDD
converged: YES YES NO NO
title: Mulliken charges:
elementType: O O N N C C C C C H H H H H H H H H H
charge: -0.438024 -0.437816 -0.079403 -0.079334 -0.589336 0.210292 0.209916 -0.749166 -0.748838 0.239756 0.240138 0.249629 0.241518 0.253315 0.249903 0.241312 0.252904 0.366623 0.366610
chargesum: 0.00000
title: Mulliken charges with hydrogens summed into heavy atoms:
elementType: O O N N C C C C C
charge: -0.071401 -0.071206 -0.079403 -0.079334 -0.109442 0.210292 0.209916 -0.004704 -0.004719
polarizability: 1.10718238e+02 1.51611826e+01 7.22309841e+01 -2.31438482e-04 1.82663652e-02 5.77059567e+01
1716.lowfreq: -6.6657 0.0003 0.0005 0.0007 6.3895 15.7650 35.1920 51.1895 66.6107
frequency: 35.1824 51.0935 66.5450 68.4381 111.9268 253.0203 266.8454 275.7119 292.1285 342.2233 389.4265 404.8403 414.0037 509.4301 514.3729 596.7493 649.1893 796.3054 808.3996 868.6118 872.3214 950.0963 997.1804 1012.3130 1034.0681 1035.6999 1155.5268 1231.7772 1252.0317 1280.0434 1307.4189 1316.1058 1388.2239 1388.2980 1444.0675 1455.0053 1455.4251 1462.1203 1464.4399 1604.7093 1621.6829 2987.4381 2987.4784 3000.5167 3068.0567 3068.7724 3069.6284 3110.9383 3111.1720 3565.6556 3566.0340
redmass: 2.9686 1.7008 1.3929 1.5312 2.4924 4.3860 8.0255 3.3533 4.0650 6.0126 1.7345 1.2767 1.3537 2.6323 2.3720 4.3757 3.3395 3.8140 4.3037 3.0412 10.1254 1.9543 1.4837 1.5208 1.5901 1.7158 1.3145 2.0510 1.7342 1.3070 1.7334 1.9895 1.2143 1.2167 1.0869 1.0519 1.0515 1.0832 1.0800 6.8870 6.1830 1.0369 1.0369 1.0581 1.0954 1.0952 1.1030 1.1013 1.1013 1.0674 1.0675
irintensity: 0.3519 0.0412 0.1184 0.7092 0.2500 0.3329 1.6645 0.8628 0.0098 13.7737 6.3219 113.3013 122.4254 53.8541 24.2606 63.0579 11.7364 0.0021 36.8642 94.0705 9.4224 51.1764 8.4530 42.7659 1.6567 60.5687 27.7916 94.1185 12.9774 18.5667 10.8322 5.5172 54.0434 23.2319 25.9779 11.7112 11.3727 17.9001 0.2308 6.0639 0.4075 12.5238 3.4976 11.1118 8.2833 12.7191 8.1005 3.9898 12.3744 82.9110 2.6016
temp: 298.150 k
press: 1.00000 atm
elementType: 8 8 7 7 6 6 6 6 6 1 1 1 1 1 1 1 1 1 1
symmnumber: 1
zpe: 394640.2 jmol-1
zpe.correction: 0.150311 hartree
zpe.thermalcorrener: 0.161587 hartree
zpe.thermalcorrenthalpy: 0.162531 hartree
zpe.thermalcorrgfe: 0.112173 hartree
zpe.sumelectzpe: -455.659957 hartree
zpe.sumelectthermal: -455.648681 hartree
zpe.sumelectthermalent: -455.647737 hartree
zpe.sumelectthermalfe: -455.698095 hartree
dipole: 0.0008 0.0004 -0.1478
dipole: 0.1478
quadrupole: -48.5161 -50.7797 -54.8673
quadrupole: 4.4888 -0.0013 0.0035
quadrupole: 2.8716 0.6080 -3.4796 4.4888 -0.0013 0.0035
hfenergy: -455.8102679 hartree
pointgroup: C01 [X(C5H10N2O2)]
dipole: 0.000138 0.0010865 0.0581503 debye
dipolederiv: -1.127126 0.0857179 0.2136979 -0.3098543 -0.0873581 -0.0443615 0.6215498 -0.2507704 -0.465787 -1.1211392 0.0733788 -0.2210702 -0.338636 -0.0762201 0.0252127 -0.6116888 0.2335068 -0.4823971 0.571464 -0.1593302 -0.2571697 0.1325193 -0.3407381 0.0025563 -0.5525451 0.1782348 -0.0820331 0.5655748 -0.145563 0.2679125 0.1580704 -0.3479722 0.0098766 0.5501553 -0.1663982 -0.0700961 -0.0825564 -0.0281443 0.0002284 0.1228134 0.0261165 0.0016354 -0.0029328 0.0007757 0.0613974 0.1605077 0.0416327 -0.1037297 0.0290792 0.2823688 -0.1837401 -0.2399033 -0.1882551 0.0896549 0.1592162 0.0446748 0.1015641 0.0393534 0.296572 0.1756326 0.2373243 0.1805996 0.076703 0.0016989 -0.0839377 0.0878034 -0.0178023 -0.1656911 0.1545354 0.0989182 0.1504176 -0.0485575 0.0034861 -0.0876485 -0.0834549 -0.023036 -0.1759037 -0.1492799 -0.0946347 -0.1483947 -0.0380595 0.0323143 0.0264844 0.0439351 -0.022495 -0.0289794 -0.1165316 0.0380596 -0.0701612 0.0480639 0.0326063 0.0240998 -0.0451729 -0.0247691 -0.0202243 0.1193957 -0.0371227 0.0731424 0.0389091 0.0099425 -0.0970674 -0.0576422 -0.0436775 0.0047191 -0.0151119 -0.0722048 -0.0471354 0.0722032 -0.0408975 0.1151644 -0.0185827 0.0978722 0.0710218 0.0035638 -0.0065223 0.0022708 0.1021542 0.0986147 0.0257956 0.0495911 0.0163583 0.0761656 -0.0627311 0.0276461 0.0022429 -0.0547362 0.0052844 -0.095897 0.0609327 -0.0408896 0.0095539 0.0156582 0.0717474 0.0474405 0.0729164 -0.0390945 0.1172213 0.0093748 0.0993218 0.0689903 -0.0012256 -0.0017248 0.0021741 0.1019809 0.1006797 0.0240284 -0.0460549 0.0148273 0.0769112 0.0581253 -0.0242041 -0.0066271 -0.059416 0.3349472 0.0592095 -0.000593 0.0550718 0.1695932 0.1058685 0.0035191 0.1106423 0.3141139 0.3344768 0.0601804 -0.0015698 0.0558729 0.1610744 -0.0990789 -0.0054362 -0.1037054 0.3229857 unknown
polarizability: 110.80612|-15.0418772|72.1350988|0.4678617|-0.3320244|57.7139598 unknown
InChI: InChI=1S/C5H10N2O2/c1-4(6-8)3-5(2)7-9/h8-9H,3H2,1-2H3
charge 0 multiplicity 1
19 atoms
O  -3.327959 0.270428 0.538757
O  3.316427 -0.250509 0.569051
N  -2.181625 0.626434 -0.323481
N  2.176002 -0.646042 -0.283767
C  -0.001195 -0.028172 -1.076482
C  -1.236623 -0.285102 -0.221809
C  1.229331 0.267739 -0.227776
C  -1.303322 -1.516302 0.649957
C  1.290313 1.536051 0.589665
H  0.206056 -0.91708 -1.700595
H  -0.205013 0.831182 -1.741691
H  -2.064956 -2.219042 0.261858
H  -0.326534 -2.024614 0.683003
H  -1.620554 -1.252358 1.674623
H  2.069463 2.212129 0.189471
H  0.318838 2.05524 0.577967
H  1.580636 1.314514 1.632388
H  -3.951024 1.023142 0.369813
H  3.942438 -1.007936 0.435849
