program: Gaussian 09
title: 000094810
version: EM64L-G09RevD.01
frameworkgroup: C1[X(C12H8N4O5)]
method: RPBEPBE
basis: SDD
operation: Freq
keyword: #p
keyword: freq=noraman
keyword: PBEPBE/SDD
title: #p freq=noraman PBEPBE/SDD
converged: NO YES NO NO
title: Mulliken charges:
elementType: O O O O O N N N N C C C C C C C C C C C C H H H H H H H H
charge: -0.264626 -0.194880 -0.194481 -0.203091 -0.201129 -0.089789 -0.073946 0.025242 0.023535 0.406358 0.197427 -0.294585 -0.347831 0.402190 -0.332065 -0.334010 -0.332362 -0.263574 0.388996 -0.334109 -0.338838 0.297189 0.303552 0.295315 0.296148 0.263248 0.316052 0.292740 0.291329
chargesum: 0.00000
title: Mulliken charges with hydrogens summed into heavy atoms:
elementType: O O O O O N N N N C C C C C C C C C C C C
charge: -0.264626 -0.194880 -0.194481 -0.203091 -0.201129 -0.089789 -0.073946 0.025242 0.023535 0.406358 0.197427 0.002604 -0.044279 0.402190 -0.036751 -0.037862 -0.069115 0.052477 0.388996 -0.041369 -0.047509
polarizability: 4.57185529e+02 1.51089053e+01 1.90236629e+02 -3.55639301e-02 1.91135473e-01 6.42470980e+01
1716.lowfreq: -3.7979 -2.9603 -0.0005 -0.0004 0.0005 9.2658 23.7818 28.3077 56.6068
frequency: 23.7744 28.2947 56.5918 57.5240 66.6878 71.6665 90.6266 150.5528 155.7078 186.5189 229.4242 255.1189 306.7963 326.9856 343.5435 387.0017 414.0828 416.1802 449.0653 461.3193 493.2173 507.4100 520.1496 525.1135 616.3907 621.3742 632.1616 638.6531 664.2188 669.2245 691.3325 744.1177 748.3854 764.9126 786.9204 825.0740 846.9904 856.2195 856.9468 877.3744 888.6112 994.6121 997.3040 999.3952 1004.3763 1005.4362 1010.2162 1074.1695 1091.3037 1092.6743 1104.6622 1111.7292 1161.4863 1172.2931 1205.0705 1217.4110 1219.2086 1220.6723 1284.9468 1294.3778 1345.2618 1363.4731 1372.1555 1400.8705 1408.5955 1422.3383 1433.4887 1459.5402 1466.3829 1569.5409 1599.9070 1601.3623 1606.8347 3168.5890 3180.4520 3181.7438 3183.7063 3191.5657 3197.7862 3205.3016 3225.6726
redmass: 10.2676 6.1758 11.8858 10.2891 6.2540 7.1040 8.4992 10.2430 9.1473 10.5238 8.8331 7.2771 6.6385 10.8240 6.9017 8.6195 2.9387 2.9620 8.4581 3.9449 9.4292 7.1938 3.5053 6.3155 7.5927 7.1645 8.3253 7.1378 4.4123 4.3679 8.6766 5.2171 4.6844 9.7516 9.4251 6.9307 1.2452 1.2437 9.7204 1.6478 1.6169 3.0413 1.3375 3.1217 1.3351 1.3471 1.3607 3.8443 3.3792 3.1063 1.2563 1.3034 1.3492 1.4032 6.0663 5.7789 5.1014 5.5202 1.2681 1.3392 6.9162 8.2710 10.0570 7.8033 6.9967 4.7148 5.4911 2.2838 2.4591 7.7997 6.5447 6.6284 8.5879 1.0895 1.0917 1.0895 1.0903 1.0968 1.0965 1.0962 1.0941
irintensity: 1.7245 0.1281 0.8749 1.7012 0.0101 0.0114 4.4644 0.0673 5.0238 1.4503 7.8841 0.0017 0.4000 0.0233 0.3553 23.8767 0.0002 0.0538 0.5272 0.1319 6.3266 0.1325 14.9653 0.4807 0.2761 0.4609 2.6138 0.2707 42.2553 21.8795 0.2461 0.4644 1.7767 75.1566 15.9277 25.6014 0.2461 0.0654 9.9020 34.2463 122.4704 3.5739 0.3488 15.1203 0.0072 0.0120 0.0468 11.9489 13.9928 28.6433 24.0589 27.3165 0.7296 60.3653 612.7631 159.8770 212.8360 40.8203 0.0286 0.2722 114.9941 59.3323 69.2072 21.0101 46.1032 46.4100 42.6411 2.5803 24.8259 4.9092 3.7748 41.7624 4.8556 1.6156 1.1242 2.2468 2.4926 1.1874 2.3439 0.3236 2.5953
temp: 298.150 k
press: 1.00000 atm
elementType: 8 8 8 8 8 7 7 7 7 6 6 6 6 6 6 6 6 6 6 6 6 1 1 1 1 1 1 1 1
symmnumber: 1
zpe: 509000.1 jmol-1
zpe.correction: 0.193868 hartree
zpe.thermalcorrener: 0.211017 hartree
zpe.thermalcorrenthalpy: 0.211961 hartree
zpe.thermalcorrgfe: 0.146052 hartree
zpe.sumelectzpe: -1055.492797 hartree
zpe.sumelectthermal: -1055.475649 hartree
zpe.sumelectthermalent: -1055.474704 hartree
zpe.sumelectthermalfe: -1055.540613 hartree
dipole: 1.3600 -0.1877 -0.0238
dipole: 1.3731
quadrupole: -197.0539 -113.9116 -119.5754
quadrupole: 5.4355 0.0087 0.1245
quadrupole: -53.5403 29.6021 23.9382 5.4355 0.0087 0.1245
hfenergy: -1055.6866654 hartree
pointgroup: C01 [X(C12H8N4O5)]
dipole: -0.5352757 -0.0115846 0.0721142 debye
polarizability: 457.0501676|-7.9484384|78.1776574|14.2713108|-39.5033524|176.4414306 unknown
InChI: InChI=1S/C12H8N4O5/c17-14(10-5-7-12(8-6-10)16(20)21)13-9-1-3-11(4-2-9)15(18)19/h1-8H
charge 0 multiplicity 1
29 atoms
O  -0.108726 0.671003 -1.894907
O  -6.404111 -0.533829 1.601146
O  -6.858999 0.200589 -0.511132
O  6.659057 -0.539779 1.309794
O  6.722264 0.230224 -0.8387
N  -0.428961 0.246265 -0.688527
N  0.392635 -0.106265 0.290342
N  -6.042127 -0.128863 0.431057
N  6.086794 -0.143442 0.221465
C  -1.864394 0.141587 -0.370497
C  1.79285 -0.059701 0.121636
C  -2.292092 -0.298795 0.904338
C  -2.782295 0.495892 -1.384679
C  -4.583898 -0.033181 0.150741
C  -3.670229 -0.386964 1.168303
C  -4.161506 0.407073 -1.121886
C  2.488604 -0.48061 1.3009
C  2.545398 0.337658 -1.032562
C  4.604327 -0.114696 0.189733
C  3.887076 -0.51176 1.343238
C  3.950794 0.307088 -0.988093
H  -1.549227 -0.562515 1.658524
H  -2.402437 0.83077 -2.352307
H  -4.047479 -0.721815 2.137627
H  -4.906698 0.669724 -1.876665
H  1.891461 -0.778246 2.167586
H  2.028902 0.660119 -1.935099
H  4.432457 -0.83145 2.234357
H  4.549162 0.605016 -1.853135
