program: Gaussian 09
title: 000094779
version: EM64L-G09RevD.01
frameworkgroup: C1[X(C12H13ClN2O4S)]
method: RPBEPBE
basis: SDD
operation: Freq
keyword: #p
keyword: freq=noraman
keyword: PBEPBE/SDD
title: #p freq=noraman PBEPBE/SDD
converged: YES YES NO NO
title: Mulliken charges:
elementType: Cl S O O O O N N C C C C C C C C C C C C H H H H H H H H H H H H H
charge: -0.081947 0.329505 -0.190007 -0.185728 -0.199091 -0.192611 0.008424 0.019125 -0.452259 -0.369217 -0.417300 -0.370827 -0.395655 -0.377134 -0.392644 0.494901 -0.050867 -0.501475 -0.455218 0.449158 0.304125 0.312275 0.237619 0.236567 0.222096 0.241930 0.219147 0.217508 0.215423 0.218007 0.266344 0.340377 0.299448
chargesum: 0.00000
title: Mulliken charges with hydrogens summed into heavy atoms:
elementType: Cl S O O O O N N C C C C C C C C C C C C
charge: -0.081947 0.329505 -0.190007 -0.185728 -0.199091 -0.192611 0.008424 0.019125 -0.148134 -0.056942 0.056886 0.093199 0.041000 0.056297 -0.392644 0.494901 0.215478 -0.161098 -0.155770 0.449158
polarizability: 3.13089351e+02 -5.95458001e+00 2.19205886e+02 1.49614345e+01 9.01938778e+00 1.04532502e+02
1716.lowfreq: -4.9706 -0.0020 -0.0013 -0.0010 2.8604 7.2895 20.3188 33.3824 47.5076
frequency: 20.3096 33.3264 47.4537 54.3322 72.4980 99.8666 122.9436 130.7326 162.5971 165.8498 169.8989 195.0134 220.0806 280.7568 287.6134 299.5713 332.7783 342.8776 349.3434 373.8899 440.8418 452.8799 464.4688 490.1228 504.0356 519.2549 558.4417 590.0381 649.6731 657.9960 660.2488 677.4598 695.4093 711.6531 735.0668 756.6677 797.0910 813.2827 834.2307 868.2666 870.9125 875.4786 901.8204 975.0390 991.9285 996.7933 1029.1865 1046.6394 1061.3173 1075.6465 1081.1874 1116.7148 1124.5982 1126.7844 1153.0806 1165.2717 1183.9830 1192.8102 1210.7303 1213.1283 1253.7560 1267.3942 1272.9113 1299.0460 1327.1770 1342.8249 1346.0274 1350.3187 1360.4379 1361.3638 1367.9257 1384.3664 1422.0218 1445.7404 1451.0429 1452.2785 1467.5884 1475.1923 1573.7632 1599.4172 2974.8666 2980.9233 2990.6596 2993.6653 3046.1860 3053.5368 3058.9847 3061.2390 3063.6697 3076.9970 3177.6825 3185.7563 3196.6767
redmass: 7.4609 7.5670 8.4205 14.2835 10.3709 6.5872 5.1931 5.9476 5.3723 7.6309 7.7996 3.6114 4.1134 7.9248 8.8188 3.9013 7.1738 5.0830 2.6089 4.3559 3.4133 2.3643 4.5064 8.3222 4.8550 7.3233 4.4908 6.5309 7.4260 4.5928 5.3466 2.6551 8.7559 5.2882 6.3649 12.4837 4.0238 1.5229 1.4369 3.6263 4.3807 2.4147 1.4720 1.4402 1.8308 1.7767 5.0905 1.6386 1.7868 1.7624 1.8116 4.9842 1.3650 1.1200 1.5199 1.7028 1.2577 11.2498 1.3527 4.5501 1.3958 1.3765 1.2162 1.5666 1.4165 1.4963 1.5000 4.0165 4.8418 1.4365 1.6709 10.0193 7.1962 1.0876 2.0264 1.1610 1.0817 1.0869 8.6980 7.0297 1.0662 1.0644 1.0621 1.0613 1.0964 1.1000 1.0978 1.0857 1.1006 1.0887 1.0891 1.0919 1.0949
irintensity: 0.8868 0.2803 0.8618 0.0120 2.4086 2.5472 0.5140 1.9840 1.2999 2.0016 4.0556 4.3309 1.9858 3.5560 5.1779 1.0540 5.2043 1.9597 1.5420 3.6908 0.9468 1.4580 3.2650 0.4292 6.9637 19.3882 27.7836 15.0298 13.6023 2.5873 19.0440 12.4577 10.1801 10.7782 1.6915 18.2268 1.8017 13.0066 26.2000 5.3404 32.7234 2.9374 17.5380 27.2264 14.4204 18.7922 64.4590 0.9944 4.0630 4.1455 31.2340 16.5843 5.0084 1.5336 4.6883 24.1020 46.1350 357.9621 50.9671 285.3162 7.9508 14.1475 2.1596 1.8414 0.7996 2.3320 4.6104 68.9217 60.9335 2.6756 19.0168 78.7627 17.1688 17.1207 70.2312 17.8175 17.0382 20.3292 44.0959 144.6572 15.1702 18.9781 14.1604 31.6111 61.1218 33.1055 13.0369 7.8321 41.4155 13.6222 4.0000 23.8562 2.2885
temp: 298.150 k
press: 1.00000 atm
elementType: 17 16 8 8 8 8 7 7 6 6 6 6 6 6 6 6 6 6 6 6 1 1 1 1 1 1 1 1 1 1 1 1 1
symmnumber: 1
zpe: 632306.2 jmol-1
zpe.correction: 0.240833 hartree
zpe.thermalcorrener: 0.259475 hartree
zpe.thermalcorrenthalpy: 0.260420 hartree
zpe.thermalcorrgfe: 0.191717 hartree
zpe.sumelectzpe: -1731.951802 hartree
zpe.sumelectthermal: -1731.933159 hartree
zpe.sumelectthermalent: -1731.932215 hartree
zpe.sumelectthermalfe: -1732.000918 hartree
dipole: -6.1455 -0.8988 -0.6060
dipole: 6.2404
quadrupole: -154.0213 -154.7170 -126.1449
quadrupole: -3.1558 -1.8790 -0.3361
quadrupole: -9.0602 -9.7559 18.8162 -3.1558 -1.8790 -0.3361
hfenergy: -1732.192635 hartree
pointgroup: C01 [X(C12H13Cl1N2O4S1)]
dipole: -2.3122435 0.822232 -0.0730156 debye
polarizability: 312.4936483|-13.8320346|216.7825906|-2.9329541|-23.133917|107.5515007 unknown
InChI: InChI=1S/C12H13ClN2O4S/c13-9-3-1-2-4-11(9)20-12-6-5-8(14(16)17)7-10(12)15(18)19/h5-7,9,11H,1-4H2
charge 0 multiplicity 1
33 atoms
Cl -2.997904 3.072867 -1.056467
S  -1.397563 -0.826937 0.670471
O  2.144792 -3.562772 0.81921
O  -0.089026 -3.122267 0.932377
O  4.757261 2.006062 -0.290657
O  5.391867 -0.165296 0.033438
N  1.142448 -2.753001 0.770633
N  4.498896 0.761067 -0.060381
C  -2.336329 0.864193 0.510533
C  -2.484857 1.208769 -0.981162
C  -3.689542 0.685641 1.234404
C  -3.527758 0.367063 -1.727746
C  -4.672123 -0.231079 0.468336
C  -4.87632 0.269192 -0.98014
C  0.343118 -0.352417 0.437972
C  1.401807 -1.318382 0.515024
C  0.733662 0.995806 0.177877
C  2.756648 -0.962483 0.353684
C  2.073848 1.367315 0.017455
C  3.07949 0.377698 0.107615
H  -1.72955 1.614642 1.042687
H  -1.5182 1.217399 -1.508795
H  -4.133565 1.696147 1.330722
H  -3.511343 0.310071 2.25871
H  -3.09644 -0.649582 -1.844365
H  -3.663277 0.778167 -2.743593
H  -5.63858 -0.257241 1.004649
H  -4.288926 -1.271446 0.453851
H  -5.550443 -0.412066 -1.531349
H  -5.359416 1.265368 -0.966443
H  -0.019009 1.782266 0.105526
H  3.531805 -1.730127 0.42303
H  2.355831 2.405364 -0.177006
