program: Gaussian 09
title: 000094792
version: EM64L-G09RevD.01
frameworkgroup: C1[X(C18H35NO2)]
method: RPBEPBE
basis: SDD
operation: Freq
keyword: #p
keyword: freq=noraman
keyword: PBEPBE/SDD
title: #p freq=noraman PBEPBE/SDD
converged: YES YES NO NO
title: Mulliken charges:
elementType: O O N C C C C C C C C C C C C C C C C C C H H H H H H H H H H H H H H H H H H H H H H H H H H H H H H H H H H H
charge: -0.245049 -0.285076 -0.152224 -0.386538 -0.384964 -0.385645 -0.386038 -0.385115 -0.371484 -0.381845 -0.385012 -0.373069 -0.538342 -0.353254 0.243074 -0.371879 -0.366119 -0.290984 -0.302128 -0.356907 -0.696725 0.193885 0.194931 0.191171 0.192706 0.193343 0.192371 0.195593 0.197623 0.192974 0.193591 0.186433 0.185352 0.191773 0.191265 0.226184 0.214936 0.189359 0.189604 0.226387 0.227858 0.187310 0.187467 0.234483 0.229347 0.224353 0.265309 0.191230 0.221024 0.200563 0.223300 0.194866 0.194826 0.214915 0.209478 0.209514
chargesum: 0.00000
title: Mulliken charges with hydrogens summed into heavy atoms:
elementType: O O N C C C C C C C C C C C C C C C C C C
charge: -0.245049 -0.285076 -0.152224 0.002278 -0.001088 0.000069 0.007177 0.001451 0.000300 0.001194 0.056108 0.005894 -0.084097 0.021523 0.243074 0.091951 0.123542 0.121270 0.121735 0.032785 -0.062818
polarizability: 2.82745183e+02 -3.82214783e+00 1.89249867e+02 2.96110143e-01 -3.50496438e+00 1.60601501e+02
1716.lowfreq: -3.9747 -0.0023 0.0009 0.0018 4.0550 12.3002 14.6263 18.3589 26.8042
frequency: 13.2143 18.3188 26.6928 44.7566 48.0055 50.7669 63.0075 68.0102 79.3056 93.8817 96.4042 111.5122 118.7585 122.3848 140.4143 144.6779 153.0990 159.0669 161.0036 200.5684 227.3112 243.2152 246.3678 278.2098 309.6588 344.3083 352.8975 394.7689 405.5615 421.1626 451.7646 481.4563 485.6965 515.5640 543.6931 563.2145 620.6812 721.5364 722.0278 724.2889 731.2835 747.3589 757.0943 774.9658 794.8514 812.1152 832.3937 855.4490 887.2325 894.4596 901.6206 933.8776 949.0377 978.8433 985.6041 994.0860 1007.9922 1011.3493 1022.4354 1030.9791 1031.4226 1047.3259 1050.4109 1067.1681 1070.9799 1072.6114 1079.5276 1081.7009 1083.2397 1090.5425 1099.7334 1111.5439 1123.9004 1181.1598 1182.5052 1191.4081 1195.4634 1198.6910 1208.6648 1221.4488 1227.9076 1245.4286 1248.9750 1259.5600 1267.1301 1271.9600 1273.8289 1277.8933 1282.7054 1284.0274 1290.2891 1293.3368 1296.6065 1299.1791 1300.4342 1315.9995 1325.6557 1334.7886 1341.2767 1347.8406 1352.5790 1354.0612 1355.4216 1357.3751 1358.7745 1365.8758 1389.4797 1410.9237 1442.9653 1446.6930 1452.2143 1454.1396 1459.7119 1460.4347 1461.5751 1461.9956 1463.4104 1464.6980 1466.7524 1471.0521 1475.7231 1476.7424 1480.3361 1484.6282 1488.0673 1490.1671 1583.0581 2944.2862 2945.5476 2949.0248 2949.5905 2950.6615 2951.5909 2953.4036 2956.0071 2957.1917 2958.7878 2961.5235 2965.4797 2969.0695 2970.7803 2971.8529 2981.3617 2982.0890 2983.6946 2986.4974 2990.9060 2997.3643 3000.0455 3005.9776 3007.4940 3017.6582 3027.7045 3036.5816 3043.4412 3065.2718 3068.5051 3070.2562 3079.9604 3081.6340 3089.2513 3095.6349
redmass: 4.2791 4.3489 4.0228 3.7934 1.7940 4.0028 2.8318 2.0085 3.1213 1.7529 3.4830 2.7324 4.0896 1.8994 2.3626 1.9123 3.4122 2.0793 2.0454 2.8914 1.1326 3.9724 2.8262 2.9615 2.8625 3.9157 4.4674 1.8913 3.6182 3.4516 2.7347 3.3190 3.1825 3.2511 2.7162 3.3217 2.3166 1.0603 1.0630 1.0774 1.1042 1.1574 4.1427 1.2041 4.1206 1.2555 1.6662 1.2795 1.9055 2.6821 1.2757 3.2072 1.2433 5.1626 4.5618 1.1802 3.8684 2.3713 2.8574 1.0832 3.4532 3.0803 2.1836 2.8202 3.6117 2.6885 2.0211 2.2042 2.2842 2.7185 1.5220 1.9092 2.9879 1.9118 2.2358 1.0755 1.4553 1.5975 1.4650 1.4595 1.3626 1.3478 1.3484 1.6191 1.2688 1.2817 1.2271 1.0299 1.0387 1.1896 1.0748 1.1752 1.2433 1.1163 1.1186 1.3785 1.2541 1.4299 1.2350 1.5207 1.3742 1.6955 1.6043 1.6437 1.6405 1.3072 1.2177 2.7041 1.1032 1.0829 1.0912 1.0926 1.0744 1.0736 1.1161 1.0720 1.0704 1.0650 1.0802 1.0839 1.0840 1.0425 1.0876 1.0925 1.0958 1.0973 8.0206 1.0683 1.0589 1.0585 1.0585 1.0589 1.0591 1.0595 1.0595 1.0594 1.0680 1.0591 1.0585 1.0584 1.0678 1.0368 1.0649 1.0959 1.0967 1.0979 1.0995 1.0998 1.0660 1.0954 1.1031 1.1047 1.1051 1.1049 1.1045 1.1032 1.1007 1.0993 1.0962 1.0958 1.0987 1.0926
irintensity: 0.1926 0.2159 0.0904 0.0828 0.6118 0.5686 1.7260 0.3880 0.7170 0.2235 0.1038 0.2634 0.7587 0.2424 0.0984 0.6173 0.2742 0.2310 0.0005 4.1022 0.0013 2.5272 2.1320 17.1683 1.9636 9.1149 0.5089 0.8382 0.8432 2.5036 0.4304 0.5353 1.0694 0.8931 7.7421 18.3740 3.9977 18.4282 5.2824 6.0462 0.1389 2.8143 0.2929 0.1764 18.6931 2.4562 0.3725 0.1739 4.7771 2.1912 1.7723 7.5992 0.2368 1.6944 7.7905 0.7965 19.4834 8.6595 22.2711 0.0522 2.2641 3.9844 32.0915 1.0142 35.3802 4.0408 0.1756 1.1686 0.6513 12.8920 1.1428 0.7866 9.2505 0.2703 8.7217 0.3257 8.1828 1.1914 142.6478 1.2019 37.3846 0.9917 10.1118 46.6490 0.1693 5.3470 18.8315 1.0640 0.3029 0.3457 0.1634 2.1266 4.1906 0.0426 0.3402 2.6625 1.0789 2.0534 7.3412 0.8846 1.6180 0.4039 0.3611 0.1052 0.1547 1.3516 11.3552 132.5832 22.0394 4.5327 16.8996 5.7290 0.2579 0.0928 9.8438 0.3077 0.3690 0.1508 0.4369 1.5700 1.5320 12.2717 1.9034 3.6259 3.2361 41.1593 244.5554 45.0667 10.0475 0.6061 0.9100 0.3036 0.7558 0.7818 19.8133 6.3369 47.7564 0.1768 138.0623 215.0198 42.6289 36.1285 69.3500 0.9141 1.7290 1.9084 1.4261 2.2943 25.1610 14.4058 0.0898 0.2660 11.5486 0.1164 291.5907 76.2314 101.4456 55.8303 40.4347 11.4627 36.6417 17.3819
temp: 298.150 k
press: 1.00000 atm
elementType: 8 8 7 6 6 6 6 6 6 6 6 6 6 6 6 6 6 6 6 6 6 1 1 1 1 1 1 1 1 1 1 1 1 1 1 1 1 1 1 1 1 1 1 1 1 1 1 1 1 1 1 1 1 1 1 1
symmnumber: 1
zpe: 1321511.8 jmol-1
zpe.correction: 0.503337 hartree
zpe.thermalcorrener: 0.528964 hartree
zpe.thermalcorrenthalpy: 0.529908 hartree
zpe.thermalcorrgfe: 0.443235 hartree
zpe.sumelectzpe: -910.381053 hartree
zpe.sumelectthermal: -910.355426 hartree
zpe.sumelectthermalent: -910.354482 hartree
zpe.sumelectthermalfe: -910.441155 hartree
dipole: 0.4533 2.8205 -0.5708
dipole: 2.9131
quadrupole: -144.2346 -138.3703 -129.6480
quadrupole: -9.1956 2.9398 -0.0068
quadrupole: -6.8170 -0.9527 7.7696 -9.1956 2.9398 -0.0068
hfenergy: -910.8843903 hartree
pointgroup: C01 [X(C18H35N1O2)]
dipole: -0.178299 1.1017843 0.2605085 debye
polarizability: 282.7443732|3.8334814|188.9948947|0.2991457|4.4197721|160.8572827 unknown
InChI: InChI=1S/C18H35NO2/c1-2-3-4-5-6-7-8-9-10-11-12-13-18(20)19-14-16-21-17-15-19/h2-17H2,1H3
charge 0 multiplicity 1
56 atoms
O  8.613129 1.138494 -0.332865
O  4.807029 -1.979992 -0.252793
N  6.113837 -0.144134 0.303033
C  -2.83387 -0.514907 -0.018357
C  -1.517167 0.291177 0.050633
C  -4.098107 0.373609 0.001826
C  -0.253179 -0.597065 0.019357
C  -5.415453 -0.433117 -0.045337
C  1.062776 0.206297 0.125318
C  -6.679374 0.455924 -0.028345
C  2.320437 -0.688066 0.063911
C  -7.997299 -0.350578 -0.064643
C  3.622351 0.122095 0.223533
C  -9.260979 0.538898 -0.048511
C  4.878158 -0.752345 0.072439
C  6.340899 1.267096 0.674094
C  7.357731 -0.940827 0.200004
C  7.360589 1.90665 -0.295588
C  8.342918 -0.250495 -0.759171
C  -10.579331 -0.26792 -0.082986
C  -11.835966 0.629332 -0.065939
H  -2.872133 -1.225367 0.833945
H  -2.836452 -1.135341 -0.939018
H  -1.512319 0.903676 0.976933
H  -1.482179 1.008899 -0.795882
H  -4.066978 1.074801 -0.858503
H  -4.088115 1.003929 0.915923
H  -0.299934 -1.331043 0.850745
H  -0.244886 -1.191538 -0.917885
H  -5.447441 -1.131487 0.817224
H  -5.425054 -1.066496 -0.957182
H  1.099913 0.954784 -0.694725
H  1.058979 0.784399 1.074035
H  -6.650881 1.149887 -0.894614
H  -6.665962 1.09407 0.880235
H  2.350939 -1.23926 -0.894027
H  2.274166 -1.461379 0.854163
H  -8.026217 -1.043471 0.802503
H  -8.010796 -0.989823 -0.972428
H  3.648274 0.933374 -0.534195
H  3.630063 0.623273 1.213106
H  -9.248413 1.178908 0.858791
H  -9.234262 1.231194 -0.916221
H  5.396928 1.833319 0.647835
H  6.747201 1.31518 1.705747
H  7.819641 -1.029143 1.204215
H  7.081142 -1.947121 -0.156996
H  6.920908 1.963574 -1.315819
H  7.644094 2.917683 0.041288
H  7.930156 -0.250463 -1.790873
H  9.32401 -0.752389 -0.75299
H  -10.590902 -0.906658 -0.989898
H  -10.605004 -0.95976 0.783773
H  -12.764534 0.029666 -0.093198
H  -11.863467 1.254311 0.846813
H  -11.847413 1.310583 -0.937831
