program: Gaussian 09
title: 000009278
version: EM64L-G09RevD.01
frameworkgroup: C1[X(C18H21N2OS)]
method: RPBEPBE
basis: SDD
operation: Freq
keyword: #p
keyword: freq=noraman
keyword: PBEPBE/SDD
title: #p freq=noraman PBEPBE/SDD
converged: YES YES NO NO
title: Mulliken charges:
elementType: S O N N C C C C C C C C C C C C C C C C C C H H H H H H H H H H H H H H H H H H H H H
charge: 0.263949 -0.226407 -0.129534 -0.340066 -0.109804 -0.559472 -0.578894 -0.582553 0.107862 -0.711736 0.506669 0.435919 -0.347312 -0.364169 -0.297243 -0.308431 -0.247536 -0.248420 -0.217142 -0.222636 -0.225352 -0.228532 0.293667 0.266933 0.264616 0.267689 0.249081 0.265149 0.331285 0.303249 0.280919 0.258593 0.278140 0.229178 0.257665 0.271993 0.254157 0.266728 0.272189 0.251637 0.255354 0.254182 0.258435
chargesum: 1.00000
title: Mulliken charges with hydrogens summed into heavy atoms:
elementType: S O N N C C C C C C C C C C C C C C C C C C
charge: 0.263949 -0.226407 -0.129534 -0.340066 0.183863 0.239766 0.266622 0.260208 0.107862 0.053247 0.506669 0.435919 -0.347312 -0.364169 -0.025251 -0.054274 0.019192 0.023769 0.034495 0.032717 0.028830 0.029903
polarizability: 2.31343130e+02 -2.33931009e+01 2.46701636e+02 2.44447280e+01 9.97067595e+00 1.85134506e+02
1716.lowfreq: -9.9152 -0.0012 -0.0004 0.0006 4.7667 8.6642 26.0358 48.6047 57.1916
frequency: 25.3169 48.5867 57.1526 64.7526 82.2320 97.9234 135.0631 159.1484 190.0801 203.1955 208.1349 215.8692 240.4175 261.7610 264.2561 284.2635 294.6721 314.2221 325.3942 331.6619 365.4893 376.4233 383.9039 394.0676 415.4159 429.3444 437.5636 439.1972 465.0754 502.1523 513.8179 536.2424 562.9650 612.4932 647.6008 660.1098 673.5940 684.2994 713.1811 722.1294 735.1332 750.3936 765.5408 773.1992 809.7464 861.8943 869.8818 876.7638 920.5954 937.3110 942.9323 953.5489 956.3942 995.8012 997.7872 1003.7188 1018.1081 1027.9687 1040.4258 1048.7661 1052.1215 1068.2514 1081.2685 1103.3118 1123.0956 1127.7622 1139.9309 1168.0235 1178.6792 1181.4131 1208.0708 1228.4829 1231.4126 1243.8829 1262.8948 1279.1297 1284.2136 1327.5114 1357.7145 1373.1939 1380.2661 1400.4536 1415.9438 1420.8377 1429.1435 1433.4864 1447.1336 1447.6301 1450.2988 1459.2407 1463.5333 1469.4265 1472.6658 1478.8767 1484.3563 1491.7759 1507.5964 1571.3714 1581.5981 1582.0368 1592.2908 1599.8351 3007.9191 3022.2925 3024.3997 3028.0187 3059.7621 3096.7162 3119.3554 3136.7936 3139.2667 3139.8625 3142.6116 3149.7388 3150.3151 3152.6367 3154.0342 3155.1159 3160.8849 3163.4991 3175.1970 3180.1083 3188.3287
redmass: 3.8142 4.1031 5.8102 3.8711 5.8984 3.1605 4.0714 4.8372 4.5047 1.2538 3.7019 1.1740 2.3350 1.7983 1.5862 2.2502 1.7960 2.0911 2.7149 4.7051 6.3509 5.9221 3.1131 6.2251 3.7508 4.6356 2.9381 3.4914 4.0355 3.3526 4.1732 3.8164 5.2715 5.8327 5.7281 5.4853 5.8162 5.3287 4.6166 4.5947 4.0922 3.3255 1.2646 1.3316 3.3693 2.2484 1.3733 1.8385 2.6907 2.9519 3.3352 1.3864 1.5690 1.3714 1.3387 1.8487 5.5450 2.8485 2.5290 1.2225 2.7769 1.5516 1.7028 1.3301 1.6448 1.8041 1.6385 1.8820 1.0709 1.1228 1.8338 1.8572 2.0209 1.7987 1.6618 1.9439 2.0608 1.8263 1.8173 9.6620 10.7058 1.1981 1.1407 1.1500 2.1828 2.1891 1.1617 2.4412 1.0608 1.0569 2.4542 1.0637 1.0473 1.0496 1.0646 1.0566 1.0489 6.4154 6.5167 6.7021 7.4449 6.9929 1.0369 1.0321 1.0319 1.0333 1.0865 1.0980 1.1013 1.1056 1.0888 1.1045 1.1052 1.1049 1.0870 1.0889 1.1053 1.1054 1.0915 1.0945 1.0964 1.1007 1.0989
irintensity: 2.6230 2.3331 2.4559 0.2801 0.7694 0.6523 0.5889 0.1085 11.2405 0.6597 2.4980 0.0437 1.9480 0.5964 1.2434 2.3770 5.9109 6.9835 7.0711 1.5389 4.4398 1.3717 0.4502 2.1891 0.4574 6.1158 0.1150 0.1370 9.6540 6.6126 1.1926 0.7391 1.2062 7.7705 20.8558 2.8351 6.3512 6.7644 2.2845 4.6190 4.5421 5.5572 29.8062 133.8996 28.7843 1.1960 1.5925 0.7107 10.9247 5.3691 23.4168 2.0648 3.4371 1.5120 0.0165 12.5119 16.0996 4.6764 1.4184 0.6926 4.6797 22.6954 5.2134 2.4883 6.8495 14.9024 7.9365 14.3434 0.0939 1.5778 4.1025 2.7004 14.2430 11.6123 31.3987 28.1467 4.5213 37.7591 32.5081 8.3349 5.2023 33.2161 65.6371 22.7599 4.5783 32.0390 42.0329 94.3879 1.3080 2.4293 23.0560 7.7704 13.1358 39.2302 30.8138 61.2167 55.6600 145.9571 27.6708 71.2275 23.4007 49.6420 6.7152 2.3163 15.7411 12.0260 3.6097 15.6766 4.4660 0.5908 4.0266 4.8764 4.5370 3.7609 0.4773 1.4301 1.7881 5.2201 2.9701 3.4617 8.2054 6.8568 2.4283
temp: 298.150 k
press: 1.00000 atm
elementType: 16 8 7 7 6 6 6 6 6 6 6 6 6 6 6 6 6 6 6 6 6 6 1 1 1 1 1 1 1 1 1 1 1 1 1 1 1 1 1 1 1 1 1
symmnumber: 1
zpe: 925742.7 jmol-1
zpe.correction: 0.352597 hartree
zpe.thermalcorrener: 0.373236 hartree
zpe.thermalcorrenthalpy: 0.374180 hartree
zpe.thermalcorrgfe: 0.304066 hartree
zpe.sumelectzpe: -1279.465780 hartree
zpe.sumelectthermal: -1279.445141 hartree
zpe.sumelectthermalent: -1279.444197 hartree
zpe.sumelectthermalfe: -1279.514310 hartree
dipole: -9.0810 0.6461 1.7395
dipole: 9.2687
quadrupole: -75.9003 -112.7600 -119.0734
quadrupole: -0.4064 -5.9019 -3.8780
quadrupole: 26.6776 -10.1821 -16.4955 -0.4064 -5.9019 -3.8780
hfenergy: -1279.8183765 hartree
pointgroup: C01 [X(C18H21N2O1S1)]
dipole: 3.5598881 -0.1050623 0.7833697 debye
polarizability: 233.7302803|-25.1121076|243.5150589|-21.1748446|-15.583319|185.9339326 unknown
InChI: InChI=1S/C18H21N2OS/c1-13(20(2,3)4)18(21)19-14-9-5-7-11-16(14)22-17-12-8-6-10-15(17)19/h5-13H,1-4H3
charge 1 multiplicity 1
43 atoms
S  -1.721912 -0.661669 1.936702
O  0.958346 2.232634 -0.869197
N  2.975827 1.00091 0.94217
N  -0.183713 0.219045 -0.498096
C  2.331879 0.300862 -0.325217
C  4.07204 0.087194 1.488547
C  3.578643 2.372037 0.617438
C  1.912589 1.176591 2.032607
C  0.971098 0.989979 -0.609352
C  3.24036 0.3795 -1.561493
C  -1.487914 0.870598 -0.427751
C  -0.182478 -1.224964 -0.343358
C  -2.318812 0.542759 0.671428
C  -0.859793 -1.785441 0.76928
C  -1.928965 1.786798 -1.406371
C  0.408242 -2.071894 -1.311349
C  -3.588903 1.139195 0.808302
C  -0.881555 -3.184771 0.954667
C  -3.194273 2.395529 -1.260892
C  0.39968 -3.470148 -1.117934
C  -4.019807 2.076443 -0.157733
C  -0.232646 -4.024125 0.020988
H  2.190329 -0.743582 -0.002448
H  3.618941 -0.851044 1.843912
H  4.806309 -0.124948 0.698952
H  4.572648 0.598925 2.32493
H  3.877967 2.84248 1.567279
H  4.46067 2.239051 -0.024802
H  2.813976 2.971392 0.102679
H  1.212264 1.966195 1.72679
H  1.368471 0.23005 2.175357
H  2.418598 1.466983 2.966187
H  3.285092 1.405406 -1.960165
H  4.261146 0.004217 -1.376999
H  2.806874 -0.258005 -2.351351
H  -1.28287 2.034278 -2.251706
H  0.841174 -1.638578 -2.219754
H  -4.235172 0.868789 1.648922
H  -1.419264 -3.613601 1.805968
H  -3.536367 3.114879 -2.01106
H  0.858623 -4.125129 -1.864815
H  -5.003498 2.54464 -0.053821
H  -0.253345 -5.108864 0.163962
