program: Gaussian 09
title: 000094756
version: EM64L-G09RevD.01
frameworkgroup: C1[X(C13H10N2O3)]
method: RPBEPBE
basis: SDD
operation: Freq
keyword: #p
keyword: freq=noraman
keyword: PBEPBE/SDD
title: #p freq=noraman PBEPBE/SDD
converged: YES YES NO NO
title: Mulliken charges:
elementType: O O O N N C C C C C C C C C C C C C H H H H H H H H H H
charge: -0.423593 -0.207109 -0.198323 -0.063057 0.020475 0.478626 -0.491098 0.379550 -0.383522 0.235806 -0.372625 -0.365611 -0.193816 -0.333115 -0.296504 -0.359482 -0.342927 0.280949 0.325099 0.237043 0.207948 0.289009 0.240272 0.260490 0.235653 0.226408 0.254195 0.359259
chargesum: 0.00000
title: Mulliken charges with hydrogens summed into heavy atoms:
elementType: O O O N N C C C C C C C C C C C C C
charge: -0.064335 -0.207109 -0.198323 -0.063057 0.020475 0.478626 -0.165998 0.379550 -0.146478 0.235806 -0.164678 -0.076602 0.046455 -0.072625 -0.060850 -0.133074 -0.088732 0.280949
polarizability: 3.75551084e+02 2.71788033e+01 1.80649270e+02 -2.27005495e+00 5.75324927e+00 6.68295787e+01
1716.lowfreq: -5.4118 -4.8137 -3.6531 -0.0006 -0.0005 -0.0003 23.0462 38.3093 44.9651
frequency: 22.9910 38.2941 44.9481 58.9365 105.2170 144.3744 159.1120 201.7906 225.2774 260.5088 294.8749 367.7865 372.9484 378.1387 391.9605 415.6701 428.8476 463.6617 493.3340 503.2258 522.5893 546.2856 617.7529 633.8083 661.6977 686.3536 703.5649 726.0968 756.5045 779.8817 806.4985 816.4670 831.2705 840.7800 927.6427 930.3646 946.6073 954.9590 964.1028 981.9871 986.7473 995.2096 1001.1092 1072.2114 1085.9559 1100.0289 1141.5688 1158.5562 1174.6921 1184.8867 1215.9100 1239.2443 1257.7798 1273.7304 1304.9293 1356.1017 1376.0995 1382.7819 1404.3377 1434.1577 1435.3972 1475.1436 1498.9965 1564.8682 1577.1731 1591.4204 1614.6638 1630.5203 2955.1411 3121.9020 3129.1254 3135.5154 3159.9565 3168.3353 3172.8124 3184.2172 3188.6045 3580.7377
redmass: 4.2237 9.0979 7.8547 7.6585 5.3095 6.7260 4.6414 5.6867 8.5743 2.9994 5.3830 5.2947 1.5324 2.7126 5.4209 3.0472 3.3465 6.2958 6.4874 3.4229 5.2787 3.3754 6.2831 6.9531 8.0489 2.3405 4.6571 3.9387 8.1745 6.6226 1.2704 1.4947 1.9929 4.2147 1.5224 2.9040 1.4269 1.3695 1.4500 1.6195 6.1330 2.6810 1.3762 1.7281 1.7664 1.3999 1.3709 1.5473 1.1325 1.9040 6.8531 2.3956 2.6297 1.3422 1.4179 1.9811 11.5397 3.9664 4.0801 3.7413 2.9442 2.8763 2.8890 6.6658 6.3083 6.2292 7.0211 6.5627 1.0858 1.0901 1.0893 1.0888 1.0930 1.0947 1.0959 1.0920 1.0963 1.0660
irintensity: 2.0557 0.1673 0.3898 1.4958 0.9368 0.8964 1.9453 7.2477 4.0780 7.5348 4.6169 18.9665 106.7385 40.0573 13.5625 4.6642 0.6474 7.2672 16.3600 4.7685 1.0820 28.2339 0.5314 0.2719 16.9887 28.2117 21.1610 1.9535 40.8402 13.1946 6.1292 15.3392 78.0564 20.7727 2.1558 3.7617 1.1821 1.8354 0.7582 33.2187 0.5837 2.4759 2.8465 36.4024 23.7067 94.4238 314.8446 1.5396 9.8841 34.8657 233.4412 43.2770 58.0887 0.7378 4.8364 1.8017 98.5429 38.6464 7.2745 4.5214 14.4335 9.2842 107.2816 23.1221 47.2179 51.7359 4.7247 86.7862 61.9081 24.0134 8.2902 5.1638 19.2691 7.0087 6.3526 4.8248 5.5486 93.9294
temp: 298.150 k
press: 1.00000 atm
elementType: 8 8 8 7 7 6 6 6 6 6 6 6 6 6 6 6 6 6 1 1 1 1 1 1 1 1 1 1
symmnumber: 1
zpe: 534358.0 jmol-1
zpe.correction: 0.203526 hartree
zpe.thermalcorrener: 0.218658 hartree
zpe.thermalcorrenthalpy: 0.219602 hartree
zpe.thermalcorrgfe: 0.159000 hartree
zpe.sumelectzpe: -835.203913 hartree
zpe.sumelectthermal: -835.188781 hartree
zpe.sumelectthermalent: -835.187837 hartree
zpe.sumelectthermalfe: -835.248438 hartree
dipole: -4.1292 3.8136 -0.8558
dipole: 5.6856
quadrupole: -106.3129 -94.9721 -106.7496
quadrupole: 29.5497 1.5173 3.3043
quadrupole: -3.6347 7.7062 -4.0714 29.5497 1.5173 3.3043
hfenergy: -835.4074388 hartree
pointgroup: C01 [X(C13H10N2O3)]
dipole: 1.6164665 1.47349 -0.4684826 debye
polarizability: 375.8067092|-26.8494716|149.6622443|3.5700314|-50.3882708|97.5609794 unknown
InChI: InChI=1S/C13H10N2O3/c16-13-6-4-11(5-7-13)14-9-10-2-1-3-12(8-10)15(17)18/h1-9,16H
charge 0 multiplicity 1
28 atoms
O  6.510856 -0.318337 0.07793
O  -5.440669 -1.254423 0.83342
O  -3.458455 -2.293157 1.264715
N  0.865471 0.005678 0.165905
N  -4.149839 -1.29564 0.829702
C  -1.317301 0.985364 -0.244775
C  -2.014673 -0.140404 0.269831
C  -3.418759 -0.116781 0.288433
C  -2.060605 2.098732 -0.726181
C  2.281539 -0.026032 0.104552
C  0.155852 1.01091 -0.285479
C  -4.17144 0.98343 -0.187225
C  -3.472605 2.096073 -0.697232
C  2.931143 -0.933703 0.985218
C  3.084292 0.745337 -0.791563
C  4.333443 -1.04549 1.009849
C  4.483156 0.628457 -0.785614
C  5.110876 -0.258868 0.123367
H  -1.45541 -1.002724 0.641632
H  -1.525318 2.969473 -1.124301
H  0.605856 1.938207 -0.698278
H  -5.263037 0.947768 -0.150138
H  -4.029199 2.960893 -1.071746
H  2.306523 -1.538668 1.64932
H  2.612761 1.4150 -1.519771
H  4.817515 -1.743707 1.70451
H  5.107306 1.200539 -1.478213
H  6.861921 -0.974829 0.729732
