program: Gaussian 09
title: 000094751
version: EM64L-G09RevD.01
frameworkgroup: C1[X(C14H16O4)]
method: RPBEPBE
basis: SDD
operation: Freq
keyword: #pfreq=noraman
keyword: PBEPBE/SDD
title: #p freq=noraman PBEPBE/SDD
converged: YES YES NO NO
title: Mulliken charges:
elementType: O O O O C C C C C C C C C C C C C C H H H H H H H H H H H H H H H H
charge: -0.271871 -0.236403 -0.255065 -0.245139 0.444561 0.134124 -0.353449 -0.386783 -0.357998 0.178834 0.123966 -0.242046 -0.243826 -0.224603 -0.216706 -0.232457 -0.674702 -0.672900 0.258918 0.236706 0.273735 0.232284 0.231526 0.230380 0.230499 0.231528 0.226123 0.233130 0.212017 0.234177 0.227872 0.210227 0.232205 0.231134
chargesum: 0.00000
title: Mulliken charges with hydrogens summed into heavy atoms:
elementType: O O O O C C C C C C C C C C C C C C
charge: -0.271871 -0.236403 -0.255065 -0.245139 0.444561 0.134124 -0.094531 -0.150077 -0.084263 0.178834 0.123966 -0.009762 -0.012300 0.236276 0.240945 0.000673 -0.000635 0.000666
polarizability: 2.76466067e+02 4.72757447e+00 1.58740665e+02 -3.60991063e+00 2.07625534e+01 1.11104760e+02
1716.lowfreq: -18.2275 -7.7449 -3.6318 -0.0004 0.0003 0.0006 4.5959 22.6064 27.6382
frequency: -17.2403 22.1921 27.6045 42.9097 60.9693 62.2479 76.6735 96.2672 117.7542 143.5294 151.6807 205.7675 209.9283 234.2922 253.7820 260.6857 283.4525 316.6824 348.6358 359.8157 403.3858 409.6862 488.2935 544.1648 571.0995 586.4632 616.2842 684.8604 697.1065 722.5266 762.3601 775.2228 797.3728 798.1111 800.9344 805.4147 841.2039 853.1241 884.8319 930.1034 977.3701 986.1133 989.8431 1003.5603 1008.7715 1021.0111 1029.8840 1032.4170 1092.9368 1112.3304 1112.9594 1131.2907 1135.4811 1146.4013 1175.1764 1185.2917 1202.7470 1246.3885 1248.9905 1250.4951 1331.4572 1347.7241 1356.1038 1372.7531 1395.3605 1399.7653 1400.6119 1441.2139 1462.0494 1463.1469 1471.0382 1473.0077 1484.2214 1485.2284 1486.2017 1578.7995 1592.1844 1606.2069 1618.6310 1639.2015 2995.9862 2996.1334 3009.0959 3009.4271 3067.9020 3068.6695 3087.0102 3092.7187 3092.8089 3107.7156 3108.5073 3123.5704 3133.0727 3147.4652 3164.1885 3183.7115
redmass: 3.6576 3.1585 3.5333 3.0324 2.8537 3.0621 5.7546 5.1924 3.2451 3.5733 3.4321 2.5525 5.0074 1.9757 1.6770 2.1259 5.2489 3.9141 4.9952 3.3378 2.8229 5.2880 3.8294 6.2010 4.8163 6.7511 6.5848 6.9677 1.7796 5.8177 6.1960 2.0231 1.1516 1.1053 4.3165 4.2244 4.5598 1.2536 4.7347 1.3731 1.5412 1.9184 2.6021 1.4651 2.6969 2.4728 2.2393 3.6946 1.7233 2.2527 2.2616 1.4605 1.4660 5.6166 1.1034 2.5243 1.1614 1.2853 1.1433 2.3630 1.5099 1.3338 1.3922 2.5236 2.1225 1.4323 1.2786 2.2201 1.0401 1.0402 1.0654 1.0635 1.7283 1.1410 1.1473 5.6059 10.4375 6.9743 8.4282 9.0523 1.0358 1.0358 1.0581 1.0579 1.1066 1.1067 1.0876 1.0986 1.0985 1.1026 1.1025 1.0870 1.0880 1.0936 1.0993 1.0957
irintensity: 0.7434 0.5347 0.3907 0.8104 1.7566 0.3768 0.4484 1.2660 2.1626 0.1364 1.0501 3.7004 2.3695 2.9657 2.9968 7.2025 6.0772 3.0036 12.4825 7.3780 0.4949 0.1822 13.1957 9.3655 5.0046 5.2719 0.0099 12.3691 54.7602 2.8298 12.5267 47.4417 4.3263 2.7518 1.1375 5.6484 2.4354 0.5440 32.8433 1.3497 3.3948 6.7297 0.4754 1.1940 14.7888 68.3465 7.4981 169.9320 42.5465 7.1219 12.2294 5.4452 8.1311 712.5142 16.1756 324.6723 6.1442 14.8145 0.6720 89.5884 9.7859 11.9230 0.9473 9.8181 27.7726 6.4419 25.8070 20.5657 12.6297 12.3959 5.7704 3.4057 20.4074 18.8970 10.6787 9.2061 327.2897 43.0424 69.7721 145.4335 22.4060 21.4687 25.2282 14.1592 7.6303 7.5352 0.3377 34.3428 28.0341 43.6268 34.9952 3.7313 1.1121 26.4346 29.1613 12.2803
temp: 298.150 k
press: 1.00000 atm
elementType: 8 8 8 8 6 6 6 6 6 6 6 6 6 6 6 6 6 6 1 1 1 1 1 1 1 1 1 1 1 1 1 1 1 1
symmnumber: 1
zpe: 706572.9 jmol-1
zpe.correction: 0.269119 hartree
zpe.thermalcorrener: 0.287062 hartree
zpe.thermalcorrenthalpy: 0.288006 hartree
zpe.thermalcorrgfe: 0.220536 hartree
zpe.sumelectzpe: -842.645645 hartree
zpe.sumelectthermal: -842.627702 hartree
zpe.sumelectthermalent: -842.626758 hartree
zpe.sumelectthermalfe: -842.694228 hartree
dipole: -0.1315 2.1437 -1.1041
dipole: 2.4149
quadrupole: -77.3753 -100.1799 -112.5931
quadrupole: -1.8984 -1.8006 -1.4789
quadrupole: 19.3408 -3.4638 -15.8770 -1.8984 -1.8006 -1.4789
hfenergy: -842.9147642 hartree
pointgroup: C01 [X(C14H16O4)]
dipole: -0.113321 -0.9210512 0.2036829 debye
polarizability: 273.6636651|-14.0916543|146.7139374|17.8517091|28.2722528|125.9338887 unknown
InChI: InChI=1S/C14H16O4/c1-3-17-13(15)12(14(16)18-4-2)10-11-8-6-5-7-9-11/h5-10H,3-4H2,1-2H3
charge 0 multiplicity 1
34 atoms
O  -2.803385 1.015777 -0.290453
O  -1.296141 -1.564525 -0.044284
O  -1.682212 2.486861 1.13339
O  -0.420196 -0.703122 -2.02244
C  2.094593 0.537924 0.373365
C  -0.472521 0.66318 0.027328
C  0.741279 1.089665 0.507639
C  3.085898 1.040255 1.270038
C  2.489512 -0.437422 -0.591726
C  -1.669052 1.485886 0.37299
C  -0.707974 -0.564167 -0.808748
C  4.411502 0.565527 1.234187
C  3.81856 -0.903946 -0.629754
C  -4.068066 1.770536 -0.039681
C  -1.663382 -2.820066 -0.774072
C  4.783163 -0.413699 0.283316
C  -5.159753 1.081242 -0.85085
C  -2.27105 -3.762518 0.258979
H  0.667803 1.993259 1.133259
H  2.800225 1.801842 2.005968
H  1.772744 -0.79865 -1.333014
H  5.152829 0.959224 1.937851
H  4.108381 -1.645045 -1.38284
H  -4.27005 1.755216 1.046696
H  -3.909769 2.820703 -0.345397
H  -2.372035 -2.551158 -1.578135
H  -0.749631 -3.230502 -1.240814
H  5.814368 -0.782067 0.245728
H  -6.121785 1.604883 -0.702663
H  -4.918281 1.094506 -1.927292
H  -5.282896 0.031688 -0.533165
H  -2.562898 -4.712042 -0.225891
H  -1.546085 -3.988629 1.059263
H  -3.168494 -3.31552 0.719323
