program: Gaussian 09
title: 000094715
version: EM64L-G09RevD.01
frameworkgroup: C1[X(C6H10O7)]
method: RPBEPBE
basis: SDD
operation: Freq
keyword: #pfreq=noraman
keyword: PBEPBE/SDD
title: #p freq=noraman PBEPBE/SDD
converged: YES YES NO NO
title: Mulliken charges:
elementType: O O O O O O O C C C C C C H H H H H H H H H H
charge: -0.241112 -0.465775 -0.467115 -0.439824 -0.376862 -0.479400 -0.160162 -0.151477 -0.150386 -0.101187 -0.093392 -0.068944 0.151997 0.229999 0.239209 0.219683 0.246101 0.230006 0.372617 0.382878 0.366324 0.355438 0.401386
chargesum: 0.00000
title: Mulliken charges with hydrogens summed into heavy atoms:
elementType: O O O O O O O C C C C C C
charge: -0.241112 -0.093158 -0.084237 -0.073501 -0.021423 -0.078015 -0.160162 0.078523 0.088823 0.118496 0.152708 0.161061 0.151997
polarizability: 1.05746545e+02 -1.78292069e+00 9.50380679e+01 4.18457280e-01 4.01539958e+00 6.29244184e+01
1716.lowfreq: -4.3908 -0.0009 0.0006 0.0011 7.6487 14.6091 38.8881 66.7315 99.6730
frequency: 38.8725 66.7288 99.6590 119.8371 167.0643 222.4719 225.0377 264.8678 274.6633 294.5105 339.0653 355.2708 378.6653 394.5230 424.5469 430.3202 456.3138 483.5913 522.3596 538.2661 563.0068 588.8014 599.8588 623.5748 686.6152 855.5931 905.9058 955.7665 964.9494 994.5387 1014.9781 1025.7228 1045.7179 1055.2838 1065.2992 1087.2130 1106.7078 1168.1793 1211.3471 1218.8187 1229.6791 1251.4959 1263.8115 1289.3371 1299.1221 1305.6578 1316.2205 1340.9056 1376.4529 1383.9382 1403.4658 1405.4916 1708.0833 2925.5367 2940.8625 2960.2811 2987.9420 3030.2229 3478.0266 3520.6593 3527.2778 3555.5224 3563.6165
redmass: 11.1365 6.9823 7.3871 4.9718 6.4637 2.4590 4.3356 4.8484 5.1141 3.7794 3.6793 2.9548 3.9547 4.8832 6.0866 1.1550 1.2029 3.2098 1.5922 2.3329 2.7047 2.8672 2.7945 2.3595 3.9343 6.6009 6.5482 4.5656 6.2701 5.2120 3.4616 5.2685 4.1267 2.7068 3.3608 2.7299 2.3475 1.3260 1.3316 1.1938 1.1845 1.2194 1.3759 1.3405 1.2620 1.2013 1.3163 1.3820 1.2899 1.7580 1.3882 1.5860 9.8413 1.0799 1.0819 1.0827 1.0860 1.0869 1.0653 1.0643 1.0654 1.0656 1.0656
irintensity: 1.5519 0.9494 4.5335 4.4775 1.2454 39.8435 8.1554 3.0295 8.2059 8.4791 35.9557 20.5548 30.4393 29.6762 16.7748 112.3356 201.1091 11.0065 81.4601 44.9701 93.3877 64.7431 74.6980 81.1233 23.2213 35.6974 111.2952 177.7979 10.5280 421.5021 17.7013 15.0335 10.0474 85.2340 36.3103 58.7847 144.9966 9.5114 16.5591 9.5001 9.6577 13.4571 20.1593 25.4888 13.5664 26.8524 20.6816 41.7108 37.5644 8.8156 42.8814 6.6922 237.2960 20.2342 20.0877 21.5781 66.1569 41.1018 95.5616 31.9849 21.6305 20.6550 25.0476
temp: 298.150 k
press: 1.00000 atm
elementType: 8 8 8 8 8 8 8 6 6 6 6 6 6 1 1 1 1 1 1 1 1 1 1
symmnumber: 1
zpe: 447990.3 jmol-1
zpe.correction: 0.170630 hartree
zpe.thermalcorrener: 0.183805 hartree
zpe.thermalcorrenthalpy: 0.184749 hartree
zpe.thermalcorrgfe: 0.131187 hartree
zpe.sumelectzpe: -760.131785 hartree
zpe.sumelectthermal: -760.118610 hartree
zpe.sumelectthermalent: -760.117666 hartree
zpe.sumelectthermalfe: -760.171228 hartree
dipole: -2.9954 3.7536 -0.5864
dipole: 4.8379
quadrupole: -71.3299 -86.5075 -72.6112
quadrupole: -3.5928 -4.1509 1.7928
quadrupole: 5.4863 -9.6913 4.2050 -3.5928 -4.1509 1.7928
hfenergy: -760.3024153 hartree
pointgroup: C01 [X(C6H10O7)]
dipole: 1.1615265 1.5017229 0.1363158 debye
dipolederiv: -1.0575972 -0.3366184 0.1042918 -0.1964567 -0.5768455 -0.0274738 0.0113551 -0.1000654 -0.3575098 -0.5611308 0.2497242 -0.1048319 0.2677743 -0.7687072 -0.1414531 -0.0742186 -0.1716899 -0.4604867 -0.5624314 -0.1663639 0.1024609 -0.2102969 -0.7871393 -0.0096613 0.1339479 0.0153282 -0.5238409 -0.9159512 0.0375679 0.0064115 0.0665575 -0.2603941 0.1369214 0.0072569 0.1522721 -0.4736701 -0.720795 -0.1415522 0.0893922 -0.2584453 -0.8491401 0.1549189 0.1396778 0.2255019 -0.1772401 -0.7697548 -0.4413177 0.1357693 -0.3688843 -0.9339311 0.0998431 0.106011 0.0615166 -0.4347631 -0.6707796 0.2898028 -0.1060527 0.0717452 -0.822233 0.1432797 -0.1393671 0.2627949 -0.3366266 0.2396313 -0.1802513 0.0121743 -0.1662496 0.5191528 0.1357174 0.0219192 0.0922207 0.3288986 0.2119197 0.2495754 -0.0869182 0.0248185 0.4313507 -0.0781377 -0.1250571 -0.0267373 0.3374346 0.573489 -0.1276324 0.0970171 -0.0501206 -0.004037 -0.0676352 0.0248701 -0.1594095 0.3431076 0.0989883 0.2114498 -0.0994949 0.3842056 0.229451 0.0383635 -0.2829723 0.0060328 0.3288474 1.2537654 0.3929326 -0.135086 0.2852774 0.8983251 -0.0676545 0.0228625 0.0017494 0.4800471 1.2966997 0.0658789 0.1100045 0.1741351 1.3956911 -0.3404932 0.2411348 -0.4177701 0.3248465 0.0226471 0.0251368 0.0086244 0.0255577 -0.0008335 -0.0255101 0.0096918 -0.0382896 -0.1727134 0.0234598 -0.0034577 -0.010103 -0.0115592 -0.0053764 0.0279661 -0.0003645 0.0277891 -0.159607 -0.0205065 0.0091784 -0.0525216 -0.0072876 0.022717 0.03139 -0.0625294 0.0482873 -0.1764358 0.0214517 -0.0122926 -0.0409555 -0.0584502 0.0355366 0.0307387 0.067183 0.0262895 -0.1205471 -0.0174316 -0.0256482 0.0271987 0.0126598 0.0254582 0.0414124 -0.0163524 0.0162146 -0.1319087 0.2929959 -0.1520139 0.0900092 -0.123766 0.2633343 0.0408035 0.09273 0.0524511 0.2982498 0.2714945 -0.0383407 -0.0261663 -0.0389981 0.430087 0.0299712 -0.0457266 0.0492672 0.3362349 0.3911669 0.0265039 -0.0269214 0.0646474 0.141522 -0.0874766 -0.0291873 -0.0950306 0.3174383 0.3926844 -0.000028 -0.0393527 -0.0115337 0.3560758 -0.1145646 -0.0197546 -0.0760305 0.0547781 0.2059844 0.0677663 -0.05495 0.1246695 0.2599357 0.0487345 -0.0831102 0.0473076 0.3754662 unknown
polarizability: 105.667794|1.7793131|94.7620138|-1.0620124|-5.2265429|63.2792232 unknown
InChI: InChI=1S/C6H10O7/c7-1-2(8)4(5(10)11)13-6(12)3(1)9/h1-4,6-10,12H
charge 0 multiplicity 1
23 atoms
O  0.12635 -1.374023 0.068681
O  -1.764716 2.341963 0.450733
O  0.944148 2.279705 -0.498163
O  -3.318914 0.052182 -0.122751
O  -1.915748 -2.529485 0.094708
O  3.128542 0.658878 -0.304225
O  2.866676 -1.555168 0.363831
C  -1.139933 1.185045 -0.195806
C  0.356922 1.098751 0.130037
C  -1.92354 -0.043418 0.287811
C  0.900252 -0.248212 -0.447828
C  -1.318909 -1.320625 -0.333747
C  2.357928 -0.51617 -0.074362
H  -1.240179 1.269984 -1.30117
H  0.506736 1.105253 1.230799
H  -1.836751 -0.107626 1.396947
H  0.84007 -0.184603 -1.560204
H  -1.405649 -1.313256 -1.437143
H  -1.265312 3.151541 0.170719
H  1.935128 2.198406 -0.440887
H  -3.624878 0.96802 0.112753
H  -2.00292 -2.53888 1.082326
H  4.082395 0.479439 -0.08396
