program: Gaussian 09
title: 000094716
version: EM64L-G09RevD.01
frameworkgroup: C1[X(C11H12O4)]
method: RPBEPBE
basis: SDD
operation: Freq
keyword: #pfreq=noraman
keyword: PBEPBE/SDD
title: #p freq=noraman PBEPBE/SDD
converged: YES YES NO NO
title: Mulliken charges:
elementType: O O O O C C C C C C C C C C C H H H H H H H H H H H H
charge: -0.301952 -0.193629 -0.442927 -0.254963 -0.480787 -0.345634 0.300379 0.235305 -0.685532 0.138344 -0.355283 -0.305443 -0.197478 -0.231957 0.141440 0.236140 0.266622 0.207967 0.226962 0.208141 0.212025 0.222021 0.257481 0.281763 0.237240 0.237192 0.386563
chargesum: 0.00000
title: Mulliken charges with hydrogens summed into heavy atoms:
elementType: O O O O C C C C C C C C C C C
charge: -0.301952 -0.193629 -0.056364 -0.254963 0.021975 0.089294 0.300379 0.235305 -0.043344 0.138344 -0.097802 -0.023680 0.039762 0.005235 0.141440
polarizability: 1.77714936e+02 1.16004729e+01 1.38721529e+02 -9.13237002e+00 3.86309758e+00 7.93118280e+01
1716.lowfreq: -12.8894 -4.0556 -0.0008 0.0005 0.0006 5.6315 33.3866 37.6107 53.4666
frequency: 33.2161 37.5836 53.4378 61.5658 104.5491 108.0333 130.6560 164.9034 220.2410 232.9723 252.5017 282.2996 333.5239 352.4426 408.0409 423.4958 485.2388 501.5500 532.0564 573.9270 585.7397 603.5283 663.5162 689.0974 707.5007 737.3305 767.2733 784.9045 797.3167 861.4719 866.2080 891.0863 913.8301 972.7279 997.4957 999.7421 1037.0679 1041.5479 1063.5614 1099.0410 1104.2330 1121.7150 1156.8020 1175.8787 1191.3500 1220.2065 1268.2730 1281.0969 1295.0128 1316.5835 1362.5045 1386.2032 1393.0916 1431.3684 1436.1048 1470.9778 1472.9703 1478.4840 1485.0986 1575.8037 1610.4319 1639.5589 1691.9990 2974.6260 2991.4818 3001.7011 3038.2002 3056.0305 3077.3737 3079.0030 3141.1453 3159.2927 3174.8417 3187.1317 3533.3554
redmass: 3.4498 3.9045 2.3935 5.0160 6.4207 3.2066 5.1665 4.7546 6.7880 1.0872 5.1170 5.4717 6.2822 3.7634 7.8310 3.1703 4.3365 3.4460 3.9617 6.5537 1.2681 5.3731 4.6962 3.5686 5.1513 1.1802 3.2762 1.7990 4.2328 3.1824 1.3585 1.5737 2.3899 1.3813 4.7128 1.3951 2.1889 2.6617 3.5703 1.5658 2.1114 2.1407 1.5678 1.1629 2.7393 1.3346 1.5001 1.1752 1.3377 2.5776 1.7001 11.1727 1.2142 2.2698 1.0823 2.4825 1.0852 1.0423 1.0769 6.7383 6.9680 8.4775 11.0562 1.0359 1.0626 1.0609 1.0974 1.0995 1.0990 1.1018 1.0867 1.0918 1.0963 1.0972 1.0642
irintensity: 0.3665 1.6318 0.1922 1.8843 0.3919 3.8600 0.5263 2.8083 0.7733 0.0909 3.3195 7.6977 3.2780 0.2506 5.3137 11.5408 8.7188 5.9616 19.5808 6.1913 103.5954 30.3737 7.9522 60.6676 3.3130 16.1058 24.4771 25.5518 38.4386 37.2497 4.5551 2.2648 142.5718 3.6018 281.0658 13.1841 1.8555 244.5256 120.0865 8.3004 106.5856 40.8532 90.4543 3.3936 51.0627 0.5882 10.0734 19.7905 31.3547 75.9803 42.1012 3.8007 7.4967 12.7632 30.4499 62.0944 2.3104 12.7529 15.3843 19.1483 26.5970 352.3686 151.2411 38.4333 3.9713 24.9570 0.7526 1.1104 48.6723 70.3006 3.6579 14.9434 6.6487 7.5111 49.8728
temp: 298.150 k
press: 1.00000 atm
elementType: 8 8 8 8 6 6 6 6 6 6 6 6 6 6 6 1 1 1 1 1 1 1 1 1 1 1 1
symmnumber: 1
zpe: 546407.2 jmol-1
zpe.correction: 0.208116 hartree
zpe.thermalcorrener: 0.222916 hartree
zpe.thermalcorrenthalpy: 0.223860 hartree
zpe.thermalcorrgfe: 0.164598 hartree
zpe.sumelectzpe: -726.173463 hartree
zpe.sumelectthermal: -726.158662 hartree
zpe.sumelectthermalent: -726.157718 hartree
zpe.sumelectthermalfe: -726.216981 hartree
dipole: -1.3374 -0.5361 -1.1103
dipole: 1.8190
quadrupole: -72.8202 -74.2096 -94.9253
quadrupole: 1.0227 -2.5175 1.0718
quadrupole: 7.8315 6.4421 -14.2736 1.0227 -2.5175 1.0718
hfenergy: -726.3815781 hartree
pointgroup: C01 [X(C11H12O4)]
dipole: -0.519355 -0.1839998 -0.4567098 debye
polarizability: 176.7726023|13.9008447|138.2674337|-8.1444886|9.5662225|80.7082569 unknown
InChI: InChI=1S/C11H12O4/c1-2-5-10(12)15-9-7-4-3-6-8(9)11(13)14/h3-4,6-7,13H,2,5H2,1H3
charge 0 multiplicity 1
27 atoms
O  0.552294 -0.801056 -0.674322
O  1.281459 -0.369108 1.516841
O  -1.731796 2.740122 0.461483
O  0.347787 1.973824 -0.198693
C  2.8635 -0.2103 -0.387696
C  4.06901 -0.211671 0.574072
C  -0.818193 -0.800831 -0.318685
C  1.542629 -0.439584 0.30667
C  5.386489 0.102647 -0.164787
C  -1.519926 0.388533 0.038857
C  -1.491283 -2.035372 -0.412416
C  -2.911559 0.288666 0.317541
C  -2.873087 -2.108976 -0.141107
C  -3.584836 -0.94386 0.232124
C  -0.849291 1.7137 0.078653
H  2.982434 -0.961562 -1.190479
H  2.77088 0.770436 -0.896364
H  4.141881 -1.19676 1.073558
H  3.893464 0.529009 1.375642
H  5.593713 -0.645261 -0.953446
H  5.345607 1.097447 -0.647168
H  6.24294 0.101612 0.533344
H  -0.916073 -2.922156 -0.694006
H  -3.447656 1.199563 0.594883
H  -3.389305 -3.072154 -0.214238
H  -4.655999 -0.997919 0.45054
H  -1.225981 3.596314 0.471999
