program: Gaussian 09
title: 000094707
version: EM64L-G09RevD.01
frameworkgroup: C1[X(C11H22O2)]
method: RPBEPBE
basis: SDD
operation: Freq
keyword: #pfreq=noraman
keyword: PBEPBE/SDD
title: #p freq=noraman PBEPBE/SDD
converged: YES YES NO NO
title: Mulliken charges:
elementType: O O C C C C C C C C C C C H H H H H H H H H H H H H H H H H H H H H H
charge: -0.286041 -0.231210 0.226634 -0.373938 -0.375875 -0.757141 0.184555 -0.722910 -0.723611 -0.079426 -0.246099 -0.690425 -0.699306 0.198522 0.214031 0.218560 0.197043 0.203218 0.232170 0.233273 0.228682 0.221757 0.214756 0.222859 0.214641 0.227565 0.212797 0.224021 0.214088 0.212689 0.200622 0.237377 0.221687 0.215719 0.208715
chargesum: 0.00000
title: Mulliken charges with hydrogens summed into heavy atoms:
elementType: O O C C C C C C C C C C C
charge: -0.286041 -0.231210 0.226634 0.038614 0.039728 -0.088479 0.184555 -0.057716 -0.058545 0.133371 0.192010 -0.039737 -0.053185
polarizability: 1.42460716e+02 -8.80452986e-01 1.19701988e+02 -7.59575674e-01 -1.30844419e+00 1.13939721e+02
1716.lowfreq: -0.0009 -0.0009 -0.0007 3.5885 5.4895 15.3960 27.5771 37.0840 56.5326
frequency: 26.6413 36.9567 56.1308 72.8099 78.9396 90.2551 135.2916 162.7443 196.6872 199.4915 208.0757 216.4004 229.3021 246.3075 250.1778 278.7273 314.1322 317.7069 362.3784 379.8951 408.2367 419.8883 465.5809 519.4383 542.9998 707.4167 748.6878 772.8006 781.2009 832.0331 863.3419 880.2854 892.8861 917.0419 926.3773 962.4290 968.5729 985.3886 1007.1187 1014.0833 1043.3179 1076.0925 1083.5070 1097.4948 1136.2366 1149.2294 1158.9263 1190.3391 1203.1631 1216.7625 1227.7943 1259.5997 1293.6520 1311.8435 1330.5668 1339.3417 1343.0112 1363.8683 1376.4331 1388.5039 1392.5676 1395.7920 1396.7002 1450.9991 1462.0567 1463.5525 1466.8994 1469.0124 1475.0623 1476.1872 1479.2817 1481.2809 1482.2604 1482.8675 1490.0431 1495.6770 1622.2471 2971.5689 2974.9394 2976.5074 2980.5600 2980.7926 2981.6826 2987.2038 2993.4005 2994.3028 3036.7757 3042.1456 3057.0128 3063.0568 3071.2006 3071.8145 3072.1809 3077.6203 3080.5221 3082.8994 3088.2124 3090.4450 3103.1646
redmass: 3.0995 2.6401 5.7129 2.2205 2.9626 2.3201 1.9165 2.2488 1.1469 1.0542 1.6581 1.7841 1.8091 2.3096 1.4036 1.4803 3.1736 2.3973 2.2902 3.4383 2.5409 2.0511 2.7172 4.4017 3.1680 4.1355 3.1965 1.2569 1.5296 2.2173 2.7565 2.2310 1.5212 1.4256 1.6706 1.5927 1.8143 1.9226 1.8593 1.4423 1.5961 1.5700 2.9289 4.5021 2.0151 1.7359 2.2466 1.7513 3.6461 2.0845 1.2778 1.1527 1.3309 1.4408 1.5103 1.4069 1.3828 1.5455 1.2146 1.2340 1.2090 1.2081 1.2090 1.0746 1.0693 1.0652 1.0551 1.0455 1.0528 1.0629 1.0451 1.0563 1.0497 1.0539 1.0588 1.0527 10.5654 1.0358 1.0373 1.0586 1.0386 1.0410 1.0553 1.0766 1.0394 1.0627 1.0997 1.0992 1.1062 1.0994 1.0994 1.0991 1.1001 1.0990 1.1004 1.1000 1.0994 1.0977 1.0985
irintensity: 0.0860 0.1334 0.4970 0.2886 0.1870 0.7615 0.6828 0.1566 0.3549 0.0115 0.6720 2.6879 1.6802 2.9445 0.7172 1.4362 8.4062 1.5186 0.3637 0.1186 2.5423 1.7693 0.0810 1.0872 0.7481 3.9872 6.3850 0.5470 16.8219 3.2568 9.7202 2.6256 3.1517 0.4846 24.5206 7.0034 20.5579 41.6859 12.8115 10.4101 7.0988 0.4311 11.8340 355.9452 4.3025 1.4270 2.8118 4.3352 6.7929 25.0732 1.4707 0.2640 0.3449 0.1553 11.2669 0.5571 0.5761 1.6983 20.5961 9.4821 26.2133 32.4864 7.9590 0.1981 1.6544 3.0284 4.2561 0.9721 23.7052 9.8026 1.5118 6.1467 20.5250 10.3951 21.0539 6.5712 166.9683 32.1821 22.3984 10.4786 39.7955 38.7110 27.8205 6.5755 33.9079 25.3384 1.1997 15.3626 5.6472 17.4618 44.2295 51.7191 68.8338 52.6122 5.4409 114.9436 34.2236 29.3230 24.1320
temp: 298.150 k
press: 1.00000 atm
elementType: 8 8 6 6 6 6 6 6 6 6 6 6 6 1 1 1 1 1 1 1 1 1 1 1 1 1 1 1 1 1 1 1 1 1 1
symmnumber: 1
zpe: 812414.1 jmol-1
zpe.correction: 0.309432 hartree
zpe.thermalcorrener: 0.326656 hartree
zpe.thermalcorrenthalpy: 0.327600 hartree
zpe.thermalcorrgfe: 0.264053 hartree
zpe.sumelectzpe: -581.746259 hartree
zpe.sumelectthermal: -581.729035 hartree
zpe.sumelectthermalent: -581.728091 hartree
zpe.sumelectthermalfe: -581.791639 hartree
dipole: 0.9012 0.1918 -2.0041
dipole: 2.2058
quadrupole: -75.0630 -81.1232 -88.7499
quadrupole: -1.2285 3.2161 1.3229
quadrupole: 6.5824 0.5222 -7.1046 -1.2285 3.2161 1.3229
hfenergy: -582.0556917 hartree
pointgroup: C01 [X(C11H22O2)]
dipole: 0.3560305 0.08267 -0.7870878 debye
polarizability: 142.4409489|-1.1083585|119.7580873|-0.7643214|-1.2205019|113.9033894 unknown
InChI: InChI=1S/C11H22O2/c1-6-11(5,7-2)10(12)13-8-9(3)4/h9H,6-8H2,1-5H3
charge 0 multiplicity 1
35 atoms
O  0.592496 -0.115469 -0.05772
O  -0.544659 -0.355146 1.95293
C  -1.824683 0.082944 -0.147941
C  -1.709699 1.490108 -0.831406
C  -1.875305 -0.99649 -1.284483
C  -3.080472 0.003179 0.750967
C  -0.573969 -0.153402 0.71648
C  -1.526891 2.685852 0.127327
C  -1.901738 -2.464209 -0.80803
C  3.012158 -0.260698 -0.36297
C  1.877724 -0.33356 0.668318
C  3.093801 1.135613 -1.020282
C  4.346972 -0.641942 0.321867
H  -2.628497 1.636437 -1.434601
H  -0.859526 1.459118 -1.539019
H  -0.999082 -0.843775 -1.941921
H  -2.778899 -0.788203 -1.892497
H  -3.987075 0.156865 0.136539
H  -3.057393 0.768379 1.544278
H  -3.155611 -0.974957 1.254097
H  -0.610527 2.578321 0.7370
H  -2.380905 2.798746 0.818436
H  -1.4362 3.626453 -0.446311
H  -2.798494 -2.688403 -0.203747
H  -1.905203 -3.149178 -1.675688
H  -1.012452 -2.705896 -0.196616
H  2.793451 -1.009059 -1.151372
H  1.833255 -1.319445 1.167868
H  1.979245 0.444899 1.449051
H  3.877254 1.156749 -1.79981
H  3.344549 1.908169 -0.26744
H  2.131727 1.409439 -1.487012
H  5.176721 -0.615072 -0.407166
H  4.30903 -1.658503 0.756285
H  4.592195 0.068235 1.13489
