program: Gaussian 09
title: 000094692
version: EM64L-G09RevD.01
frameworkgroup: C1[X(C11H18N2O3)]
method: RPBEPBE
basis: SDD
operation: Freq
keyword: #p
keyword: freq=noraman
keyword: PBEPBE/SDD
title: #p freq=noraman PBEPBE/SDD
converged: NO YES NO NO
title: Mulliken charges:
elementType: O O O N N C C C C C C C C C C C H H H H H H H H H H H H H H H H H H
charge: -0.267569 -0.212058 -0.198200 -0.376461 -0.023154 0.053516 -0.392320 -0.388550 0.120048 -0.018607 -0.717913 -0.717208 0.186991 0.046005 -0.684564 -0.683105 0.229061 0.237026 0.235574 0.225780 0.223403 0.237250 0.225662 0.233677 0.224127 0.224359 0.350379 0.253155 0.216021 0.233863 0.224341 0.219482 0.261470 0.218519
chargesum: 0.00000
title: Mulliken charges with hydrogens summed into heavy atoms:
elementType: O O O N N C C C C C C C C C C C
charge: -0.267569 -0.212058 -0.198200 -0.026082 -0.023154 0.053516 0.073766 0.072803 0.120048 -0.018607 -0.031597 -0.035045 0.186991 0.299160 -0.010339 0.016366
polarizability: 1.79097978e+02 -1.99236281e+00 1.22116977e+02 -2.45960376e+00 7.68512668e+00 1.30637617e+02
1716.lowfreq: -11.9275 -7.6193 -2.1634 -0.0009 -0.0007 -0.0003 13.7507 43.7482 60.7218
frequency: 11.5993 43.7433 60.7135 83.6320 97.5443 114.6889 139.2173 141.7568 160.6162 191.0623 191.9193 198.7586 214.4651 233.5488 265.7094 279.1569 309.7643 341.2243 348.6710 378.5448 410.8892 422.9951 442.0755 474.9648 487.0830 601.5804 629.1498 660.8736 686.5555 715.1656 718.9149 746.0731 768.1684 786.3303 797.3518 894.9687 911.9391 927.7968 928.9819 941.3825 944.5150 1012.2224 1042.3158 1068.2929 1079.7899 1083.6710 1092.0396 1140.7208 1144.2513 1160.1137 1182.4940 1197.6653 1226.9851 1255.0813 1262.9779 1299.2582 1318.1458 1319.4362 1340.3722 1348.5571 1382.4740 1396.5746 1397.9899 1398.6040 1436.1000 1445.6186 1455.2310 1456.2939 1464.7202 1473.3668 1478.2989 1480.0948 1484.7562 1486.4011 1487.8644 1546.2560 1618.5448 1643.1280 2978.5997 2979.3445 2992.3294 2995.6133 3001.6380 3008.1478 3047.1507 3056.3803 3059.7133 3078.6677 3079.1847 3082.3088 3085.9394 3087.2530 3096.8197 3101.6819 3109.5667 3515.0667
redmass: 4.0061 2.6677 4.6070 2.6395 2.5125 3.5689 6.0975 3.1553 5.8433 1.4287 1.2858 2.9911 1.2153 1.1338 3.3031 1.4358 2.1367 3.7377 4.2881 3.7761 3.4491 3.1924 3.2036 6.7699 7.8239 5.5715 4.4395 1.8489 10.4598 2.9658 3.4055 2.1742 2.0396 1.3395 3.6148 2.5958 1.9877 1.5618 1.4917 1.3233 3.7009 4.2293 1.5765 3.9031 1.4155 3.8298 1.7317 3.2217 3.1423 2.0675 1.9930 2.8701 2.7101 3.4245 1.1502 1.3468 1.3914 1.3723 1.3455 1.5257 1.2605 1.2135 1.2282 1.2129 2.7102 1.0825 1.0910 1.0670 1.0508 1.0562 1.0504 1.0519 1.0447 1.0442 1.0486 9.5843 7.8041 8.5857 1.0362 1.0363 1.0358 1.0361 1.0594 1.0595 1.0874 1.1013 1.1008 1.0990 1.0985 1.1027 1.1031 1.0991 1.0984 1.1005 1.1010 1.0772
irintensity: 2.9180 0.3829 0.5333 0.1857 0.2107 1.9510 2.9983 2.1228 8.7846 0.0494 0.3346 0.8879 1.0243 0.5713 3.0393 0.2333 3.7492 6.3008 4.3890 4.9455 2.8519 0.2549 6.5516 17.2463 3.6083 0.9857 3.3279 43.1438 3.2762 13.4753 3.8478 75.4648 22.4475 2.0241 32.6514 30.9420 9.5992 1.0212 4.7805 0.1630 1.0442 78.8096 21.1968 3.9756 0.5153 4.0065 161.2964 1.7193 10.3692 13.3177 93.0919 12.6804 259.9629 232.5494 0.4711 2.4618 10.9198 6.3868 8.1877 25.7202 35.1288 14.3961 30.7544 9.9108 264.3876 0.2402 42.1536 26.8332 5.7964 5.7225 10.9530 8.6733 26.6363 22.7445 21.8634 752.2374 150.5167 165.7336 34.7188 8.9646 12.5175 23.2884 7.8257 30.7324 1.5848 0.7969 7.6537 23.7346 52.4814 8.5446 48.1888 4.8703 39.2459 23.0784 22.4505 53.0853
temp: 298.150 k
press: 1.00000 atm
elementType: 8 8 8 7 7 6 6 6 6 6 6 6 6 6 6 6 1 1 1 1 1 1 1 1 1 1 1 1 1 1 1 1 1 1
symmnumber: 1
zpe: 736697.5 jmol-1
zpe.correction: 0.280593 hartree
zpe.thermalcorrener: 0.298509 hartree
zpe.thermalcorrenthalpy: 0.299453 hartree
zpe.thermalcorrgfe: 0.233909 hartree
zpe.sumelectzpe: -763.919564 hartree
zpe.sumelectthermal: -763.901648 hartree
zpe.sumelectthermalent: -763.900704 hartree
zpe.sumelectthermalfe: -763.966249 hartree
dipole: 3.5014 -0.8988 -1.5554
dipole: 3.9354
quadrupole: -84.1853 -95.1119 -108.9793
quadrupole: -1.0807 -3.1552 -7.0499
quadrupole: 11.9068 0.9803 -12.8871 -1.0807 -3.1552 -7.0499
hfenergy: -764.2001574 hartree
pointgroup: C01 [X(C11H18N2O3)]
dipole: 1.3783085 -0.3748448 -0.5974995 debye
polarizability: 178.1081022|3.8092567|127.6635934|-7.5683663|8.1403839|126.0808769 unknown
InChI: InChI=1S/C11H18N2O3/c1-5-11(6-2)8(14)12-10(13-9(11)15)16-7(3)4/h7,12H,5-6H2,1-4H3
charge 0 multiplicity 1
34 atoms
O  2.316183 -0.358451 -0.732059
O  -1.969273 -1.736596 -1.587808
O  -1.053744 1.521771 1.913244
N  0.156711 -0.980535 -1.086693
N  0.674183 0.629165 0.642971
C  -1.765099 -0.135518 0.277593
C  -2.413543 -1.089908 1.346045
C  -2.87665 0.808425 -0.295103
C  -1.235618 -1.010232 -0.868635
C  -0.691878 0.734529 0.999952
C  -1.4317 -2.08183 2.002558
C  -2.382422 1.792727 -1.374906
C  1.020107 -0.184278 -0.331197
C  3.390975 0.450958 -0.017316
C  4.665943 -0.376576 -0.175278
C  3.45194 1.844584 -0.65105
H  -3.228838 -1.640736 0.841107
H  -2.862943 -0.437871 2.117375
H  -3.288366 1.368464 0.563782
H  -3.676907 0.166472 -0.707334
H  -0.98454 -2.768672 1.259939
H  -0.614151 -1.556211 2.529155
H  -1.960667 -2.702405 2.747573
H  -1.59602 2.464065 -0.983336
H  -1.983404 1.262831 -2.259926
H  -3.217037 2.428088 -1.721215
H  0.54566 -1.566371 -1.832618
H  3.068635 0.524175 1.036397
H  5.499459 0.130616 0.342959
H  4.544335 -1.381289 0.263814
H  4.935619 -0.487316 -1.240165
H  4.256082 2.431382 -0.170752
H  2.501612 2.382554 -0.501034
H  3.671355 1.77619 -1.73114
