program: Gaussian 09
title: 000094670
version: EM64L-G09RevD.01
frameworkgroup: C1[X(C12H11NO2)]
method: RPBEPBE
basis: SDD
operation: Freq
keyword: #p
keyword: freq=noraman
keyword: PBEPBE/SDD
title: #p freq=noraman PBEPBE/SDD
converged: NO YES NO NO
title: Mulliken charges:
elementType: O O N C C C C C C C C C C C C H H H H H H H H H H H
charge: -0.286029 -0.255943 -0.015533 0.424276 -0.053644 0.222306 -0.519152 -0.292265 -0.329640 -0.313319 0.177873 -0.178878 -0.221731 -0.362085 -0.673738 0.275789 0.263502 0.274543 0.251432 0.232695 0.230937 0.230867 0.242850 0.213635 0.230618 0.230634
chargesum: 0.00000
title: Mulliken charges with hydrogens summed into heavy atoms:
elementType: O O N C C C C C C C C C C C C
charge: -0.286029 -0.255943 -0.015533 0.424276 -0.053644 0.222306 -0.243363 -0.028763 -0.055096 -0.061887 0.177873 0.053817 0.240073 -0.119236 0.001150
polarizability: 2.48361537e+02 4.90665744e+00 1.39918361e+02 7.36386000e-02 2.67999276e-02 6.50017523e+01
1716.lowfreq: -14.0965 -9.2875 -0.0006 -0.0005 0.0006 3.8386 27.1027 59.0692 78.7172
frequency: 27.0996 59.0356 78.7152 87.3628 133.9152 175.6100 205.0062 237.5306 272.1543 278.3524 344.3785 370.9596 397.9956 480.4152 496.0969 503.1569 525.2732 584.5870 619.2236 630.4467 721.3232 749.6399 771.3024 793.0075 798.3167 815.3207 817.5721 865.9900 890.7447 934.2780 937.4257 954.7894 991.5921 1001.4421 1023.1508 1027.6982 1072.3172 1112.6045 1117.8682 1135.9280 1144.4857 1189.8953 1224.2509 1249.8396 1253.7928 1265.9577 1347.3299 1354.4755 1359.2820 1400.7841 1402.0055 1426.2417 1458.3695 1464.1919 1472.7049 1486.0919 1493.2695 1554.1819 1588.4763 1612.7501 1632.8099 2997.5345 3011.4191 3070.2993 3094.3685 3109.2732 3123.6652 3134.7737 3140.9261 3160.9267 3169.4755 3184.4401
redmass: 3.0929 2.7880 6.5830 4.1136 2.8436 4.1400 5.1231 1.4507 3.0693 5.6868 6.7040 3.5441 3.5812 2.8311 4.2564 5.5878 6.3447 7.3944 7.7709 3.8012 3.1220 5.4262 7.5956 1.6380 1.1567 2.0773 3.8902 1.7406 5.3521 1.3857 4.3251 1.5534 1.4024 1.3444 2.3716 2.5410 3.3198 2.2392 1.7620 1.4690 1.2139 1.9403 1.8206 1.1323 2.4678 1.9135 3.1844 1.8896 1.5565 1.7357 1.8052 2.9627 3.4617 1.0401 1.0628 1.0770 3.8291 7.5737 5.9319 10.7001 7.3035 1.0358 1.0581 1.1067 1.0985 1.1027 1.0894 1.0908 1.0920 1.0887 1.0990 1.0971
irintensity: 0.8797 1.8912 0.7028 1.0451 2.9786 4.5108 4.9373 0.0670 4.9020 5.1064 5.0898 9.2836 0.9713 9.6160 0.4950 4.6664 0.3210 7.9622 3.6675 2.8606 11.8925 1.6541 2.9308 36.9838 0.1121 17.5000 0.9902 39.7853 26.4965 15.4180 24.8105 9.2608 3.9906 0.3482 46.2692 16.1622 192.6195 8.1678 34.7458 5.9155 7.3240 397.3668 1.7251 0.0114 26.4249 129.8956 13.0777 7.8531 3.0472 21.5583 4.1031 2.6478 23.1365 12.4447 5.2329 18.2661 29.6405 6.9794 1.8923 197.1499 36.6732 22.2460 20.2283 7.7998 31.6231 44.0229 18.4604 8.4521 0.8370 1.1869 28.6019 4.0181
temp: 298.150 k
press: 1.00000 atm
elementType: 8 8 7 6 6 6 6 6 6 6 6 6 6 6 6 1 1 1 1 1 1 1 1 1 1 1
symmnumber: 1
zpe: 530052.8 jmol-1
zpe.correction: 0.201886 hartree
zpe.thermalcorrener: 0.214829 hartree
zpe.thermalcorrenthalpy: 0.215773 hartree
zpe.thermalcorrgfe: 0.161169 hartree
zpe.sumelectzpe: -668.028103 hartree
zpe.sumelectthermal: -668.015160 hartree
zpe.sumelectthermalent: -668.014216 hartree
zpe.sumelectthermalfe: -668.068820 hartree
dipole: -0.5643 0.3691 0.0020
dipole: 0.6743
quadrupole: -65.3550 -89.8214 -89.6105
quadrupole: 13.6149 0.0034 0.0049
quadrupole: 16.2406 -8.2257 -8.0148 13.6149 0.0034 0.0049
hfenergy: -668.2299892 hartree
pointgroup: C01[X(C12H11N1O2)]
dipole: 0.2241657 0.1418936 -0.0006514 debye
dipolederiv: -1.860124 0.3631027 0.0008479 0.6108066 -0.6577842 -0.0000645 0.0032642 -0.0011238 -0.2771597 -0.8815388 -0.1916693 -0.0004346 -0.1400584 -0.9130611 -0.0016124 0.0002089 0.0012235 -0.321348 -0.4825178 0.0882373 -0.0002479 0.079791 -0.3150403 0.0000898 -0.0003236 0.000086 -0.2415476 -0.1433007 -0.1259097 -0.0002164 0.0834056 -0.2388343 0.0000362 -0.000105 -0.0001797 0.0764986 0.3605148 -0.0284369 0.0003758 -0.2012022 0.048747 -0.0002364 0.0003275 -0.0000337 0.0485941 -0.760424 -0.0268235 -0.0002427 -0.0104119 -0.0302384 0.0000351 -0.0010261 -0.000064 -0.0086954 0.2085599 0.0940386 0.0004506 -0.1120344 0.03856 0.0000069 -0.0004104 0.0000179 -0.1253275 -0.2565079 0.0680933 -0.0000907 0.0450493 0.1491003 0.0000481 -0.0001442 0.0001469 -0.1401984 0.0327464 -0.1078605 0.0002476 0.0851011 0.0167778 0.0000704 -0.0004084 -0.0002239 -0.1254561 0.2024153 0.0894073 0.0003906 -0.1066563 0.183891 -0.0000551 0.0005346 0.0001618 -0.1304695 2.3502688 -0.0184548 0.0002933 -0.2946527 1.2418152 0.001743 -0.0000318 -0.0000381 0.2288224 -0.1689622 -0.175432 -0.0000309 -0.2999886 -0.1644049 -0.0003347 -0.0000751 -0.0002126 -0.1149494 1.1243996 -0.1298748 -0.0006548 -0.0024258 0.2442434 -0.0000477 -0.0013308 0.0003181 0.3544084 0.3187596 0.0325171 0.0004719 0.205836 0.3298355 0.0002395 0.0004545 0.0000499 -0.0595356 -0.0984389 0.0950224 0.0001766 0.0667942 -0.0323674 -0.0002838 0.0003029 -0.0002822 0.0607467 0.1165955 -0.0021289 -0.0000793 -0.0242077 -0.014495 -0.0000424 -0.0001076 0.0000125 0.1534577 0.0793255 -0.0452984 -0.0000527 -0.0067705 -0.0433894 0.0000146 0.0000311 -0.0000781 0.1547615 0.0624346 0.0832667 -0.0002033 0.08491 0.053983 0.0000558 -0.0001957 0.0000785 0.1535863 0.0868224 -0.0620208 -0.0000785 0.0087067 -0.0727529 0.0000044 -0.0000705 -0.0000674 0.1445897 -0.0583279 0.0958782 -0.000264 0.1103376 0.0259447 0.0001337 -0.0002878 0.0001 0.1650664 -0.0822585 0.0347087 -0.0084013 -0.052757 0.0027228 0.0928695 0.034649 0.09461 -0.0574839 -0.08248 0.0342953 0.0082415 -0.0531398 0.0029596 -0.092748 -0.0347628 -0.0947404 -0.0577881 -0.133189 -0.0533874 -0.0003058 -0.0677257 0.0649719 -0.0000831 -0.0003142 -0.0000654 0.1278024 -0.185659 -0.0334822 0.0004241 -0.0544128 0.0643708 0.0000918 0.0005387 0.0000293 0.1167415 0.1255772 -0.0387279 0.0524884 0.0230286 0.0070576 0.0951617 0.0268025 0.1091402 -0.0625528 0.1253093 -0.0390605 -0.0531052 0.0226773 0.0073874 -0.0950926 -0.0275197 -0.108865 -0.0625637 unknown
polarizability: 248.1908478|-6.5230413|140.0890003|0.1266233|-0.0044821|65.001802 unknown
InChI: InChI=1S/C12H11NO2/c1-2-15-12(14)10-5-6-11-9(8-10)4-3-7-13-11/h3-8H,2H2,1H3
charge 0 multiplicity 1
26 atoms
O  3.105502 -0.303655 0.003201
O  2.427645 1.92691 0.002981
N  -3.201887 -1.376005 -0.000974
C  -1.664989 0.584571 0.000865
C  -1.916715 -0.844027 0.000596
C  0.751806 0.149074 0.003888
C  -0.317725 1.054801 0.002471
C  -0.805865 -1.748265 0.001986
C  0.5015 -1.265963 0.003556
C  -2.799281 1.462321 -0.00054
C  2.137773 0.703745 0.005759
C  -4.083818 0.917772 -0.002113
C  4.527341 0.159528 0.000833
C  -4.232835 -0.508486 -0.002261
C  5.396838 -1.09307 -0.001771
H  -0.101938 2.129653 0.002736
H  -1.027272 -2.819648 0.001764
H  1.355167 -1.94846 0.004687
H  -2.642674 2.547177 -0.000372
H  -4.974356 1.553439 -0.003233
H  4.6837 0.789225 -0.893479
H  4.687058 0.787852 0.895517
H  -5.23568 -0.952877 -0.003484
H  6.46404 -0.806035 -0.003552
H  5.205015 -1.70863 0.893465
H  5.201651 -1.707248 -0.897226
