program: Gaussian 09
title: 000094680
version: EM64L-G09RevD.01
frameworkgroup: C1[X(C15H24O3S)]
method: RPBEPBE
basis: SDD
operation: Freq
keyword: #p
keyword: freq=noraman
keyword: PBEPBE/SDD
title: #p freq=noraman PBEPBE/SDD
converged: YES YES NO NO
title: Mulliken charges:
elementType: S O O O C C C C C C C C C C C C C C C H H H H H H H H H H H H H H H H H H H H H H H H
charge: 0.132431 -0.189015 -0.249962 -0.337028 0.040169 -0.405475 -0.548470 -0.556277 -0.436336 0.028205 0.057008 0.018700 -0.669133 0.208462 -0.538662 -0.589385 -0.351700 -0.650404 -0.683836 0.238462 0.212693 0.203268 0.268390 0.233662 0.231851 0.243802 0.284062 0.214178 0.240677 0.214458 0.191266 0.289407 0.249236 0.245330 0.198879 0.255754 0.370362 0.228408 0.230449 0.217878 0.229268 0.201759 0.227207
chargesum: 0.00000
title: Mulliken charges with hydrogens summed into heavy atoms:
elementType: S O O O C C C C C C C C C C C C C C C
charge: 0.132431 -0.189015 -0.249962 0.033334 0.278632 0.010485 -0.046418 -0.080625 -0.152274 0.028205 0.057008 0.018700 0.000180 0.208462 -0.057989 -0.094819 0.102934 0.026331 -0.025602
polarizability: 2.31106838e+02 1.23014296e+01 1.82381803e+02 -1.64068895e+01 4.15299613e+00 1.69067700e+02
1716.lowfreq: -5.8366 -0.0011 0.0013 0.0020 6.8761 11.8638 20.5574 24.5004 33.6833
frequency: 20.4642 23.9120 33.5595 44.1435 53.2714 57.7438 61.5635 75.2512 90.6190 102.9176 134.0736 158.8954 170.3305 206.1230 210.0936 224.2641 234.6381 239.2629 260.2540 270.4105 283.0309 300.9375 339.6957 369.5495 395.7963 412.2560 429.3906 446.8267 454.6282 490.8081 507.6258 545.4245 561.0429 574.3663 598.0916 621.9152 632.4654 694.5501 731.9656 743.6257 790.2843 852.9298 856.1607 864.5725 880.8522 898.9984 912.4959 948.5466 985.6961 995.4753 999.0104 1027.4578 1047.1108 1051.4566 1055.1705 1066.7287 1078.3179 1080.4014 1093.3643 1120.9007 1130.9939 1149.6983 1162.1784 1170.0261 1210.8728 1221.6215 1238.9318 1244.3758 1254.0044 1267.9047 1270.7147 1276.5747 1279.8533 1282.7145 1295.1547 1299.2931 1314.5140 1316.9982 1338.0820 1347.7646 1355.8386 1388.7047 1389.2746 1396.4045 1426.1389 1437.8025 1443.2848 1459.4269 1461.5117 1468.8377 1469.0949 1470.2275 1475.3911 1477.3688 1482.4470 1484.7636 1537.7498 1557.2137 1622.9318 2944.2982 2947.3630 2953.7747 2965.8393 2972.9926 2976.4742 2982.0154 2984.8311 2989.7739 3001.6656 3011.8729 3021.2038 3041.6225 3053.0404 3055.8935 3061.2837 3071.8001 3073.8391 3079.4046 3079.5217 3086.3632 3093.8923 3099.4771 3517.8326
redmass: 4.5673 5.0290 4.2945 5.0212 3.4615 2.7468 1.7786 4.2733 3.7200 2.0453 3.6361 4.4213 3.7966 1.6760 1.6342 2.2304 1.4002 1.2408 3.6356 2.9252 3.0758 3.4095 4.9708 4.1177 2.9227 2.8325 5.1431 3.2636 2.9454 1.3809 2.7229 3.3213 3.3878 4.1889 3.9645 4.1973 4.3049 3.6715 3.9397 1.1886 1.1149 1.7218 1.6826 1.5134 1.7790 2.3967 2.2341 3.0345 1.7406 1.7646 4.8538 1.1953 2.0645 2.9447 2.7531 2.0892 2.2795 2.1020 1.5656 1.9558 1.2879 2.4474 1.8274 1.3128 3.3025 1.7076 1.2459 1.3662 1.2812 1.2676 1.4001 1.3764 1.2979 1.4605 1.5634 1.8243 1.4999 1.6926 1.3967 1.6403 1.5190 1.2062 1.2089 1.2036 1.0820 1.0891 1.1802 1.0829 1.0723 1.0675 1.0585 1.0397 1.0441 1.0501 1.0622 1.0483 5.5443 9.8279 7.4752 1.0680 1.0616 1.0677 1.0663 1.0375 1.0359 1.0787 1.0355 1.0642 1.0909 1.0573 1.0908 1.0951 1.0960 1.0940 1.0975 1.1044 1.0937 1.0988 1.0991 1.1006 1.0994 1.1045 1.0654
irintensity: 1.0931 1.0070 2.1368 1.7401 1.8105 0.5546 0.5896 2.6047 0.0718 0.9942 3.7575 5.4099 0.0880 0.7649 1.4155 2.5620 0.9044 0.3075 3.4277 2.6369 3.8533 3.3207 1.7571 7.3399 0.5731 7.9291 4.8678 12.3368 11.8790 77.0863 36.7203 7.2499 1.4829 3.7549 14.8697 18.7404 3.3060 2.8045 3.7333 11.1455 8.1617 3.1049 31.6714 7.7413 2.5165 13.6683 4.6898 41.7383 15.4878 16.8346 35.5773 0.0610 4.3742 5.7008 8.8772 14.7442 27.9879 33.3748 1.5576 3.3675 4.2123 14.4956 60.9893 16.2634 75.0994 16.1389 5.7564 13.5976 49.2425 15.2242 9.5997 18.3446 14.9530 32.5997 72.7836 100.7009 20.4294 51.3646 7.3653 5.0706 3.9425 15.6843 10.4284 18.0958 6.5888 9.0170 19.2805 9.9292 2.3619 4.2247 13.1174 13.8571 11.4547 9.5463 14.5649 9.0158 137.6091 323.2781 345.9205 54.3820 22.1555 8.8654 6.8235 36.2732 39.4620 14.1453 37.9895 25.2330 12.2843 22.1435 24.6891 10.3357 1.1088 14.7897 47.1552 1.6571 20.0551 28.3685 34.4480 32.7184 30.3937 49.6715 35.7415
temp: 298.150 k
press: 1.00000 atm
elementType: 16 8 8 8 6 6 6 6 6 6 6 6 6 6 6 6 6 6 6 1 1 1 1 1 1 1 1 1 1 1 1 1 1 1 1 1 1 1 1 1 1 1 1
symmnumber: 1
zpe: 947170.1 jmol-1
zpe.correction: 0.360758 hartree
zpe.thermalcorrener: 0.383283 hartree
zpe.thermalcorrenthalpy: 0.384227 hartree
zpe.thermalcorrgfe: 0.306203 hartree
zpe.sumelectzpe: -1208.217123 hartree
zpe.sumelectthermal: -1208.194598 hartree
zpe.sumelectthermalent: -1208.193654 hartree
zpe.sumelectthermalfe: -1208.271678 hartree
dipole: 0.2515 2.7286 0.7275
dipole: 2.8351
quadrupole: -103.0715 -131.5733 -124.2030
quadrupole: 3.3822 -16.2581 -11.2747
quadrupole: 16.5444 -11.9574 -4.5870 3.3822 -16.2581 -11.2747
hfenergy: -1208.5778811 hartree
pointgroup: C01[X(C15H24O3S1)]
dipole: -0.0906739 -1.0862474 -0.2365932 debye
polarizability: 231.645731|3.9890099|183.0476469|19.1920204|3.181597|167.8629628 unknown
InChI: InChI=1S/C15H24O3S/c1-4-6-12(16)15-13(17)8-11(9-14(15)18)7-10(3)19-5-2/h10-11,16H,4-9H2,1-3H3
charge 0 multiplicity 1
43 atoms
S  3.942407 0.347227 -1.107807
O  -1.196469 2.865667 0.341338
O  -1.915671 -1.842104 0.915548
O  -3.012339 1.692268 -1.275582
C  1.236551 0.035531 0.787632
C  2.634604 -0.114397 1.43126
C  0.74361 1.495152 0.782825
C  0.194103 -0.825036 1.533069
C  3.775934 0.69131 0.770407
C  -0.738224 1.68857 0.419047
C  -1.179215 -0.801681 0.861315
C  -1.578421 0.466267 0.190605
C  5.118119 0.498283 1.49921
C  -2.712957 0.507668 -0.628121
C  -3.671939 -0.627726 -0.899697
C  4.352335 -1.506871 -1.137943
C  -4.823831 -0.672799 0.151349
C  4.536636 -1.940496 -2.601044
C  -5.833222 -1.793149 -0.17056
H  1.306827 -0.313588 -0.263154
H  2.913964 -1.188006 1.449161
H  2.576338 0.20359 2.495458
H  1.31602 2.118579 0.070723
H  0.892384 1.953551 1.783424
H  0.078847 -0.447434 2.572596
H  0.500465 -1.883634 1.611017
H  3.518703 1.767457 0.765443
H  5.032323 0.824074 2.554478
H  5.917633 1.08615 1.017397
H  5.425598 -0.563601 1.504631
H  -4.106174 -0.506848 -1.91699
H  -3.141225 -1.591604 -0.849774
H  5.27614 -1.670835 -0.557679
H  3.523214 -2.060145 -0.663877
H  -5.341083 0.306345 0.193169
H  -4.371605 -0.851908 1.142652
H  -3.800523 1.572316 -1.867952
H  3.616052 -1.76933 -3.186983
H  5.358109 -1.38027 -3.081894
H  4.780231 -3.018027 -2.651069
H  -5.335901 -2.780209 -0.168306
H  -6.300509 -1.64789 -1.163312
H  -6.641838 -1.820618 0.581889
