program: Gaussian 09
title: 000094689
version: EM64L-G09RevD.01
frameworkgroup: C1[X(C18H21NO4)]
method: RPBEPBE
basis: SDD
operation: Freq
keyword: #p
keyword: freq=noraman
keyword: PBEPBE/SDD
title: #p freq=noraman PBEPBE/SDD
converged: YES YES NO NO
title: Mulliken charges:
elementType: O O O O N C C C C C C C C C C C C C C C C C C H H H H H H H H H H H H H H H H H H H H H
charge: -0.196213 -0.224240 -0.263840 -0.263916 0.120438 -0.440433 -0.096009 -0.373906 0.510194 0.505136 -0.700917 -0.412163 -0.423891 -0.398899 -0.374699 -0.356648 -0.356796 -0.393682 -0.367335 0.314502 0.320805 -0.536987 -0.538077 0.245393 0.249051 0.230574 0.235700 0.235550 0.223517 0.213949 0.238396 0.249105 0.230920 0.239072 0.251624 0.250676 0.240961 0.236748 0.247644 0.221359 0.220420 0.219349 0.245541 0.222031
chargesum: 0.00000
title: Mulliken charges with hydrogens summed into heavy atoms:
elementType: O O O O N C C C C C C C C C C C C C C C C C C
charge: -0.196213 -0.224240 -0.263840 -0.263916 0.120438 -0.195041 0.153042 0.092368 0.510194 0.505136 -0.027902 -0.173767 -0.174787 -0.167979 -0.135626 -0.105024 -0.106120 -0.152720 -0.130587 0.314502 0.320805 0.152436 0.148843
polarizability: 2.73830374e+02 2.38515680e+00 1.97266145e+02 8.42341085e+00 1.22898637e+01 1.86560441e+02
1716.lowfreq: -10.4244 -7.4316 0.0006 0.0007 0.0008 6.6577 23.4989 26.6427 35.9750
frequency: 22.8546 26.6202 35.9101 41.8248 45.4927 62.9598 65.9488 91.9287 99.4629 108.1023 149.1112 159.2074 167.4167 181.8969 205.1439 220.3221 232.6024 239.8646 251.2511 254.1470 293.6856 300.3758 338.0012 365.6298 411.1789 412.8960 421.6006 440.1348 459.6028 511.2276 518.1570 535.8859 552.1430 566.2283 626.2420 630.5310 636.4819 670.3614 716.0921 731.6135 752.2234 763.4257 769.5546 803.6647 809.0187 819.9290 831.1749 839.7479 851.5276 866.0586 913.1728 937.5133 939.9158 964.6623 966.0536 987.7926 988.3675 1001.0984 1003.0458 1021.7657 1059.8198 1090.5891 1110.7571 1112.0406 1113.3534 1115.2456 1121.6436 1156.2252 1157.8356 1177.8313 1182.3962 1188.2691 1201.6984 1215.9047 1230.6682 1232.8258 1236.3847 1259.0800 1267.4777 1291.6419 1303.3824 1316.5004 1328.2947 1338.9699 1377.4058 1391.3241 1401.3817 1418.8472 1420.0822 1432.7350 1436.3191 1437.4226 1461.1844 1466.9165 1467.8470 1471.4922 1473.0014 1477.3144 1486.1157 1498.5336 1502.0566 1581.7011 1582.3763 1621.3931 1623.6430 2957.6441 2958.9442 2983.8834 3003.3722 3005.1864 3044.8871 3046.4977 3053.6547 3064.6117 3082.5234 3088.2500 3119.6298 3124.3198 3126.2983 3128.2692 3131.8083 3134.1962 3160.0378 3160.5045 3167.8718 3168.3800
redmass: 3.6383 4.9686 4.8411 4.0650 5.7563 4.7519 3.4725 3.7736 3.3524 3.4616 4.3321 3.9128 3.7431 3.0623 1.5669 2.1594 1.8982 1.4169 2.8025 2.3397 3.1526 3.6708 5.2955 4.7297 2.9324 2.9495 4.1274 4.8511 4.2518 3.1937 3.5333 4.1758 3.2200 3.5333 6.7903 6.9807 4.5892 4.1340 3.8507 3.7291 4.8812 3.9234 2.4724 2.2175 1.4264 1.5451 1.7263 2.3215 2.1192 2.4597 1.8470 1.3851 1.4464 1.3671 1.3717 8.3845 8.6818 2.9173 2.6570 4.0806 2.0568 1.8518 1.4729 1.2613 1.2613 1.9022 1.5003 1.3636 1.3429 1.2772 1.3664 2.4178 1.8635 2.6800 2.1977 2.7789 1.7802 1.8961 2.0071 1.2230 1.3288 1.4521 1.4632 1.4910 4.3559 3.6303 1.2096 3.4747 2.9514 2.8825 1.2135 1.1744 1.1250 1.0501 1.0500 1.0737 1.0753 1.0545 1.0492 2.3728 2.4479 7.0017 6.8416 6.3041 6.4058 1.0331 1.0331 1.0363 1.0642 1.0803 1.1039 1.1039 1.0919 1.0936 1.0995 1.1005 1.0886 1.0990 1.0991 1.0896 1.0881 1.0892 1.0938 1.0942 1.0954 1.0956
irintensity: 0.7781 0.2219 2.4693 0.9750 0.7670 0.1148 0.2087 1.6463 1.8054 6.3550 1.9689 5.0623 2.0526 4.3087 0.8315 0.8379 0.7646 0.4592 0.7479 1.1830 3.3657 1.0704 1.0874 0.9363 0.4020 0.2790 1.5250 1.3217 1.7286 2.0458 9.7975 20.7539 25.6458 44.8837 3.1179 0.7363 0.1978 5.5551 0.6941 5.1805 9.1450 6.0729 18.8374 40.1195 23.8955 2.7735 26.8097 21.5041 29.9992 4.9013 2.7720 0.0071 0.9180 0.0862 0.3605 55.3931 27.3532 5.6243 13.5913 2.9512 2.2508 15.4569 1.3343 0.1910 0.2060 3.1683 25.4031 0.3024 0.5342 125.3437 54.5848 2.6386 2.2953 9.1015 151.2468 191.8491 59.9719 16.2199 6.7281 13.1524 7.6923 1.5246 5.8750 4.7423 10.6221 8.1522 12.4891 3.6973 2.3417 88.5736 16.4812 6.4554 1.2161 13.4672 14.1986 66.0184 54.8218 11.0206 16.0188 160.9888 81.6114 10.3476 17.1264 64.1573 42.5112 61.2515 71.2411 27.6343 8.5367 9.5236 47.4100 48.2410 2.6335 0.2618 36.7082 34.6694 26.2293 30.1525 22.0747 9.1120 5.2491 9.8261 3.6324 22.2945 5.1663 4.5369
temp: 298.150 k
press: 1.00000 atm
elementType: 8 8 8 8 7 6 6 6 6 6 6 6 6 6 6 6 6 6 6 6 6 6 6 1 1 1 1 1 1 1 1 1 1 1 1 1 1 1 1 1 1 1 1 1
symmnumber: 1
zpe: 928173.8 jmol-1
zpe.correction: 0.353523 hartree
zpe.thermalcorrener: 0.376493 hartree
zpe.thermalcorrenthalpy: 0.377438 hartree
zpe.thermalcorrgfe: 0.298762 hartree
zpe.sumelectzpe: -1052.353619 hartree
zpe.sumelectthermal: -1052.330648 hartree
zpe.sumelectthermalent: -1052.329704 hartree
zpe.sumelectthermalfe: -1052.408379 hartree
dipole: -4.3601 -2.9961 -3.0962
dipole: 6.1297
quadrupole: -131.4540 -135.2227 -127.6400
quadrupole: -13.7179 5.7974 9.7093
quadrupole: -0.0151 -3.7838 3.7989 -13.7179 5.7974 9.7093
hfenergy: -1052.7071413 hartree
pointgroup: C01 [X(C18H21N1O4)]
dipole: -1.7108248 1.0506609 1.3360803 debye
polarizability: 273.5396883|-0.1675447|195.2485625|-10.2582097|12.831633|188.8687089 unknown
InChI: InChI=1S/C18H21NO4/c1-4-17(19(20)21)18(13-5-9-15(22-2)10-6-13)14-7-11-16(23-3)12-8-14/h5-12,17-18H,4H2,1-3H3
charge 0 multiplicity 1
44 atoms
O  2.245147 -3.013772 0.922437
O  1.740768 -3.10929 -1.297547
O  -5.028716 1.988079 -0.025163
O  4.567173 2.572943 0.111232
N  1.465726 -2.804349 -0.076668
C  -0.031614 -0.858489 -0.643129
C  0.091419 -2.169502 0.201119
C  -0.988308 -3.228005 -0.124425
C  -1.378416 -0.16283 -0.413859
C  1.162569 0.084241 -0.407286
C  -0.89217 -4.500029 0.743463
C  -2.008297 0.48931 -1.50832
C  2.220152 0.139212 -1.354581
C  -2.008663 -0.080524 0.851242
C  1.257726 0.899788 0.74476
C  -3.213574 1.19377 -1.35066
C  3.334054 0.974273 -1.156831
C  -3.223671 0.620456 1.032197
C  2.371214 1.740254 0.964497
C  -3.828307 1.263656 -0.075016
C  3.415652 1.777042 0.007431
C  -5.700074 2.098743 1.271946
C  4.706837 3.407803 1.30637
H  0.007094 -1.182063 -1.701566
H  0.126954 -1.950183 1.281966
H  -0.908452 -3.485812 -1.19774
H  -1.971236 -2.745693 0.021311
H  0.052338 -5.046774 0.571683
H  -1.723319 -5.187811 0.506913
H  -0.949496 -4.257123 1.820844
H  -1.539812 0.448019 -2.498989
H  2.174654 -0.488333 -2.252155
H  -1.564235 -0.574226 1.723945
H  0.446074 0.903607 1.480819
H  -3.697276 1.695168 -2.194382
H  4.151685 1.016369 -1.882618
H  -3.68015 0.65581 2.025962
H  2.409864 2.357394 1.867056
H  -6.600064 2.700575 1.078762
H  -5.059556 2.613579 2.0145
H  -5.993606 1.103944 1.660649
H  3.888569 4.151025 1.377795
H  5.668584 3.927022 1.182921
H  4.730564 2.792524 2.227014
