program: Gaussian 09
title: 000094727
version: EM64L-G09RevD.01
frameworkgroup: C1[X(C20H16O4)]
method: RPBEPBE
basis: SDD
operation: Freq
keyword: #pfreq=noraman
keyword: PBEPBE/SDD
title: #p freq=noraman PBEPBE/SDD
converged: YES YES NO NO
title: Mulliken charges:
elementType: O O O O C C C C C C C C C C C C C C C C C C C C H H H H H H H H H H H H H H H H
charge: -0.211467 -0.211446 -0.254582 -0.254579 0.299463 0.299547 0.357608 0.357573 0.010834 0.010583 -0.517001 -0.516990 -0.331411 -0.331471 -0.389454 -0.389457 -0.368553 -0.368500 -0.366018 -0.366012 0.323781 0.323784 -0.536961 -0.536961 0.265525 0.265546 0.279301 0.279313 0.240642 0.240664 0.254537 0.254535 0.243067 0.243071 0.225470 0.225539 0.249733 0.225541 0.249735 0.225471
chargesum: 0.00000
title: Mulliken charges with hydrogens summed into heavy atoms:
elementType: O O O O C C C C C C C C C C C C C C C C C C C C
charge: -0.211467 -0.211446 -0.254582 -0.254579 0.299463 0.299547 0.357608 0.357573 0.010834 0.010583 -0.251475 -0.251444 -0.052109 -0.052158 -0.148812 -0.148793 -0.114016 -0.113965 -0.122951 -0.122941 0.323781 0.323784 0.163781 0.163786
polarizability: 6.09754137e+02 3.26905645e+01 2.12866807e+02 -1.42775139e-02 -2.46903122e-03 1.16281825e+02
1716.lowfreq: -4.5194 -3.7950 0.0001 0.0011 0.0012 1.6622 15.8568 39.5876 44.0267
frequency: 15.8106 39.5850 44.0232 62.1928 64.2869 71.6180 110.6489 115.4411 120.1513 164.0243 173.4413 176.7392 204.8531 219.0578 228.1268 241.6051 273.1864 298.4245 299.9567 344.4345 353.4622 412.3570 412.6142 427.5815 427.8947 446.9018 465.0278 467.1562 488.5097 518.6477 538.2602 542.7084 613.5522 615.3715 624.6313 637.4589 669.1069 707.9690 731.1223 754.8927 764.7665 767.4717 775.8877 803.2345 809.6050 812.1096 836.5109 841.1297 894.6728 899.9867 910.7815 942.6258 944.0888 964.2524 964.4918 980.2205 983.0680 984.6746 1002.4777 1010.0891 1111.6884 1111.6922 1120.4065 1122.1570 1157.6285 1158.2974 1172.6681 1187.3695 1197.1657 1212.8527 1245.3766 1249.3252 1262.4202 1267.1502 1306.2605 1312.0574 1330.7192 1351.5764 1367.1691 1370.1994 1429.9085 1431.0015 1437.2743 1437.3929 1468.4338 1468.4402 1470.9459 1471.4334 1491.9239 1499.1298 1510.8780 1532.1084 1558.4930 1559.9341 1572.5219 1606.4544 1617.5807 1626.1234 2966.0038 2966.1786 3057.4373 3057.4492 3130.5039 3130.5364 3134.8880 3135.0562 3145.3360 3148.1373 3163.9211 3163.9367 3165.1682 3165.2741 3196.4741 3196.5177
redmass: 6.1057 5.1305 3.6422 5.5164 5.4034 4.5769 4.8981 3.8666 5.1164 4.8622 3.6989 5.3500 2.9721 1.5352 1.4231 2.4918 4.0926 8.4666 4.2973 6.3099 5.8876 2.9543 2.9906 6.7498 4.0291 5.2849 6.7440 6.1008 4.3097 2.6387 5.8973 2.7130 6.2564 5.6900 7.1253 6.6609 5.0211 4.6420 3.9478 4.5435 3.6942 6.1058 3.7916 2.2515 1.2946 1.6898 1.7070 1.7231 6.9300 1.8175 1.5168 1.4185 1.3759 1.3657 1.3618 5.4651 8.7967 6.0065 2.5988 2.3281 1.2596 1.2595 1.4340 1.3833 1.3774 1.3300 2.1483 1.2817 1.9754 2.2364 2.5860 2.9840 1.8836 1.8882 1.4374 1.2983 3.3332 3.6330 3.9915 5.2406 3.5606 3.3921 1.2415 1.2530 1.0500 1.0499 1.0797 1.0728 3.8982 2.4916 4.2201 8.3441 6.4809 6.6630 8.3320 6.5537 6.3036 6.9153 1.0326 1.0327 1.1043 1.1043 1.0994 1.0994 1.0893 1.0892 1.0902 1.0910 1.0918 1.0918 1.0933 1.0933 1.0954 1.0954
irintensity: 2.3692 1.2511 1.2441 0.2256 0.7306 2.4175 14.8998 3.1084 0.6738 0.0080 2.3326 0.6847 1.1033 0.9382 6.0158 1.1723 15.1633 4.8739 2.0537 1.8907 0.3581 0.0082 14.1220 52.2462 0.5288 0.9525 25.0911 0.0063 55.9961 21.0403 2.2959 21.2119 24.1612 0.0483 0.0445 4.9448 5.0747 0.8072 7.1156 8.3152 3.1701 1.0981 12.1204 27.2974 10.0068 3.8477 29.8635 113.9823 0.3661 3.6846 38.9806 1.4193 0.1044 18.4584 0.3434 110.6351 6.7362 36.0885 0.7969 16.5341 0.2388 0.3503 17.9426 4.2122 6.2223 0.0212 1449.1500 1.2061 26.5424 0.4843 374.7146 1.5645 0.0746 116.8824 0.8005 9.3325 0.1393 100.2169 38.4653 0.9947 4.8131 0.0346 61.2422 1.4637 9.7484 21.5098 191.0696 0.9392 1.2563 277.8786 0.2095 709.6102 131.8143 0.9149 399.5394 0.2675 452.2951 0.5859 174.7641 13.9209 30.6231 55.3690 60.6072 1.8180 4.6005 1.1472 11.8392 0.0747 6.7694 6.2106 31.2153 2.0505 5.6292 1.7348
temp: 298.150 k
press: 1.00000 atm
elementType: 8 8 8 8 6 6 6 6 6 6 6 6 6 6 6 6 6 6 6 6 6 6 6 6 1 1 1 1 1 1 1 1 1 1 1 1 1 1 1 1
symmnumber: 1
zpe: 799954.5 jmol-1
zpe.correction: 0.304687 hartree
zpe.thermalcorrener: 0.325937 hartree
zpe.thermalcorrenthalpy: 0.326881 hartree
zpe.thermalcorrgfe: 0.253121 hartree
zpe.sumelectzpe: -1070.900280 hartree
zpe.sumelectthermal: -1070.879029 hartree
zpe.sumelectthermalent: -1070.878085 hartree
zpe.sumelectthermalfe: -1070.951845 hartree
dipole: 0.0005 -0.0009 1.1817
dipole: 1.1817
quadrupole: -78.2354 -144.9848 -139.2890
quadrupole: -31.9025 -0.0017 0.0005
quadrupole: 42.6010 -24.1484 -18.4526 -31.9025 -0.0017 0.0005
hfenergy: -1071.2049662 hartree
pointgroup: C01 [X(C20H16O4)]
dipole: -0.0001964 -0.0003406 -0.4649334 debye
polarizability: 608.0844077|-41.5761858|214.5365356|-0.0142184|0.0027893|116.2818247 unknown
InChI: InChI=1S/C20H16O4/c1-23-15-7-3-13(4-8-15)17-11-20(22)18(12-19(17)21)14-5-9-16(24-2)10-6-14/h3-12H,1-2H3
charge 0 multiplicity 1
40 atoms
O  1.107227 -2.495376 -0.154479
O  -1.107176 2.496068 -0.154213
O  7.202119 -0.454344 0.029152
O  -7.20229 0.453887 0.029326
C  1.489485 -0.079465 -0.066335
C  -1.489517 0.080111 -0.066034
C  2.963583 -0.186689 -0.074455
C  -2.963656 0.187137 -0.074097
C  0.616684 -1.31638 -0.090991
C  -0.616706 1.317017 -0.09045
C  0.843209 1.141392 -0.051889
C  -0.843191 -1.140748 -0.051512
C  3.652354 -1.290858 0.518512
C  -3.652721 1.291115 0.518917
C  3.751932 0.845809 -0.658999
C  -3.751792 -0.845489 -0.658741
C  5.052886 -1.342108 0.54108
C  -5.053258 1.342065 0.541375
C  5.158102 0.802008 -0.653538
C  -5.157972 -0.801998 -0.653344
C  5.816015 -0.298411 -0.043239
C  -5.81615 0.298244 -0.043027
C  8.043857 0.595686 -0.555687
C  -8.043783 -0.59636 -0.555473
H  1.404035 2.08097 0.004551
H  -1.404008 -2.080311 0.005202
H  3.078279 -2.105896 0.962382
H  -3.078787 2.106237 0.962811
H  3.255991 1.682664 -1.1632
H  -3.255707 -1.682214 -1.163012
H  5.581287 -2.1807 1.003897
H  -5.581862 2.180518 1.004218
H  5.723523 1.607426 -1.131256
H  -5.723186 -1.607507 -1.131156
H  7.86765 1.570979 -0.062932
H  7.868265 0.688559 -1.644566
H  9.077182 0.267662 -0.372778
H  -7.868259 -0.689134 -1.644374
H  -9.077186 -0.268639 -0.372464
H  -7.867258 -1.571627 -0.062782
