program: Gaussian 09
title: 000094685
version: EM64L-G09RevD.01
frameworkgroup: C1[X(C17H24O)]
method: RPBEPBE
basis: SDD
operation: Freq
keyword: #pfreq=noraman
keyword: PBEPBE/SDD
title: #p freq=noraman PBEPBE/SDD
converged: YES YES NO NO
title: Mulliken charges:
elementType: O C C C C C C C C C C C C C C C C C H H H H H H H H H H H H H H H H H H H H H H H H
charge: -0.422457 -0.382252 -0.360012 -0.343943 -0.407774 -0.362945 -0.479582 -0.699009 -0.154325 -0.161946 -0.576794 0.109423 -0.095047 -0.304718 -0.083167 0.079638 -0.017623 -0.568105 0.196572 0.192474 0.192563 0.207635 0.204400 0.186890 0.198685 0.202776 0.195563 0.197815 0.204425 0.208992 0.220226 0.207646 0.206061 0.225231 0.232585 0.238202 0.241888 0.243584 0.236075 0.348378 0.221079 0.220891
chargesum: 0.00000
title: Mulliken charges with hydrogens summed into heavy atoms:
elementType: O C C C C C C C C C C C C C C C C C
charge: -0.074079 0.006794 0.040186 0.047346 -0.006312 0.030432 -0.066164 -0.065076 0.070906 0.070639 -0.096704 0.109423 -0.095047 -0.061134 -0.083167 0.079638 0.218452 -0.126135
polarizability: 3.11212308e+02 -2.12603797e+01 1.69125426e+02 3.74239671e+00 5.41955206e+00 1.37002720e+02
1716.lowfreq: -13.5742 -5.9177 -0.0007 -0.0006 -0.0006 3.8295 11.4204 15.8502 31.1806
frequency: 8.5089 15.3194 30.6445 41.9992 46.0264 57.8893 73.4952 79.6558 96.0530 105.8821 122.9969 124.7113 159.1345 162.3551 184.7853 212.1096 236.8028 249.1936 264.1266 286.5538 294.2533 316.2114 333.7332 354.9888 358.6132 393.7675 430.0016 453.1292 457.0341 482.6930 503.2407 516.6487 541.9911 652.9549 708.9512 714.9590 736.5995 776.3415 809.3827 841.3360 848.8092 864.1307 887.8386 900.3565 926.1648 929.2073 957.3684 969.8791 978.1456 981.0190 1001.3649 1003.7320 1030.9777 1045.8475 1064.9631 1080.8438 1102.2942 1109.0992 1113.3328 1125.4886 1158.1055 1196.1991 1201.7985 1213.6700 1229.0187 1245.3675 1250.2565 1263.7922 1272.2660 1282.1946 1287.9881 1288.4791 1291.1328 1295.8166 1302.8935 1314.0474 1334.9327 1344.0124 1351.8166 1352.7109 1357.2234 1380.3800 1426.9559 1446.9583 1459.4202 1462.9248 1463.8992 1467.9456 1469.6490 1474.8821 1481.2630 1489.6163 1651.0986 1681.1895 2167.5640 2291.2921 2952.2725 2955.7885 2957.5311 2960.8135 2962.7863 2966.7213 2970.4038 2976.5526 2991.1899 3004.3518 3014.1102 3018.5940 3022.5231 3035.8201 3038.5782 3040.0164 3053.6921 3066.5448 3070.0976 3091.2644 3102.5810 3108.1626 3202.1136 3526.1026
redmass: 3.9867 4.3302 4.0467 3.7280 3.5424 3.5576 2.1552 3.1899 3.5174 3.1272 2.2584 2.3849 3.3139 3.3459 2.4329 2.8523 1.1439 2.7915 2.7136 1.2486 2.8815 3.0906 2.2480 3.0256 3.1925 3.9628 2.4705 6.8296 5.2982 3.6367 2.9068 7.0251 3.9374 2.7177 2.3572 1.1275 1.1453 1.4667 1.5415 2.5929 2.2583 1.7322 1.7836 1.7842 1.9383 2.9102 1.3096 1.5200 1.2430 1.7931 2.1214 1.1868 3.0608 1.9691 2.4042 2.2227 1.5062 2.4760 2.1026 2.0607 1.3161 1.5684 1.2925 1.3098 1.3237 1.4423 1.3348 1.3018 1.2262 1.5332 1.1533 1.1641 1.2460 1.1934 1.8158 1.3699 1.3635 1.4244 1.2446 1.5110 1.5468 1.2205 1.1936 1.0823 1.0755 1.0805 1.0691 1.0975 1.0814 1.0448 1.0798 1.0763 4.5945 6.5038 11.8330 11.8963 1.0536 1.0420 1.0588 1.0602 1.0602 1.0607 1.0607 1.0624 1.0955 1.0989 1.1011 1.0980 1.1019 1.0992 1.1033 1.0844 1.1021 1.0983 1.0924 1.0611 1.0900 1.0934 1.1146 1.0665
irintensity: 0.1967 0.5218 0.0736 0.3155 0.3462 0.2926 0.3244 0.5420 1.1199 0.3280 0.0259 0.1512 0.8242 0.2015 1.1870 1.3747 0.4620 1.4478 0.7012 106.1289 0.7238 51.9259 0.4044 2.3088 1.5879 12.8298 0.9452 15.5675 2.1895 4.2995 4.2555 10.8104 3.8960 8.2638 9.6937 13.1956 2.2799 5.5189 16.2328 25.0648 11.0943 5.1999 5.0051 1.7656 23.0994 71.2330 73.2686 6.0790 85.8850 9.3538 7.9187 15.9500 1.1425 2.3040 2.2685 1.0054 7.3530 2.0948 3.8461 2.6434 0.4334 3.1829 1.7490 17.9812 5.3351 2.3987 6.2809 24.0908 1.9158 6.6182 1.6220 1.6043 4.8536 2.6682 1.5783 0.7797 3.4069 2.5864 35.7046 6.9366 0.5469 12.1498 19.4062 11.3501 0.4395 11.4496 2.2027 7.1231 2.8966 10.0713 5.9312 15.9393 2.9721 0.7727 2.2352 36.7683 7.6439 35.6725 6.0319 17.4197 28.1937 12.7001 140.5829 52.0705 4.9049 3.3811 12.0827 9.3191 12.1577 44.0979 70.9481 14.2131 159.1724 51.4201 29.5645 13.5091 26.4000 7.4656 20.7697 29.4658
temp: 298.150 k
press: 1.00000 atm
elementType: 8 6 6 6 6 6 6 6 6 6 6 6 6 6 6 6 6 6 1 1 1 1 1 1 1 1 1 1 1 1 1 1 1 1 1 1 1 1 1 1 1 1
symmnumber: 1
zpe: 938430.4 jmol-1
zpe.correction: 0.357429 hartree
zpe.thermalcorrener: 0.379860 hartree
zpe.thermalcorrenthalpy: 0.380804 hartree
zpe.thermalcorrgfe: 0.301626 hartree
zpe.sumelectzpe: -735.881141 hartree
zpe.sumelectthermal: -735.858711 hartree
zpe.sumelectthermalent: -735.857766 hartree
zpe.sumelectthermalfe: -735.936945 hartree
dipole: 2.3871 -0.1071 -1.7613
dipole: 2.9684
quadrupole: -103.8172 -107.2117 -112.7188
quadrupole: 0.8905 8.5837 -2.9240
quadrupole: 4.0987 0.7042 -4.8029 0.8905 8.5837 -2.9240
hfenergy: -736.2385704 hartree
pointgroup: C01 [X(C17H24O1)]
dipole: 0.9402011 0.1415006 0.678175 debye
polarizability: 301.1245673|42.3043844|178.2036559|-6.2719305|6.2887675|138.012231 unknown
InChI: InChI=1S/C17H24O/c1-3-5-6-7-8-9-10-11-12-13-14-15-16-17(18)4-2/h4,10-11,17-18H,2-3,5-9,12H2,1H3
charge 0 multiplicity 1
42 atoms
O  -3.718859 -1.635794 -1.440266
C  2.75955 -1.817538 0.030557
C  3.427133 -1.038371 -1.126398
C  1.296792 -2.203942 -0.288126
C  4.812797 -0.431799 -0.794575
C  0.61597 -3.025989 0.829803
C  4.791187 0.644103 0.335789
C  -0.895029 -3.23358 0.583336
C  3.791687 1.747529 0.06123
C  2.722337 2.031947 0.847136
C  1.655811 3.074088 0.516531
C  0.355653 2.421217 0.27431
C  -0.690489 1.783059 0.069619
C  -4.052045 -0.440157 -0.613427
C  -1.835147 1.063603 -0.162176
C  -2.860334 0.394519 -0.376747
C  -4.714557 -0.849975 0.694167
C  -6.021336 -0.631972 0.977653
H  2.763688 -1.20121 0.951921
H  3.35174 -2.728618 0.259285
H  3.531023 -1.712442 -2.001297
H  2.745441 -0.222712 -1.441857
H  0.715758 -1.273832 -0.461087
H  1.260022 -2.775335 -1.23947
H  5.228574 0.0290 -1.714081
H  5.517724 -1.235636 -0.499793
H  0.758944 -2.508928 1.800608
H  1.117768 -4.010474 0.923374
H  5.811626 1.070169 0.425373
H  4.559714 0.169794 1.308189
H  -1.35894 -3.855199 1.37096
H  -1.071014 -3.732714 -0.38979
H  -1.410972 -2.25244 0.575504
H  3.93583 2.316697 -0.872049
H  2.55174 1.454574 1.767238
H  1.957201 3.653606 -0.378159
H  1.552358 3.801912 1.347562
H  -4.779329 0.102461 -1.243325
H  -4.062426 -1.362526 1.41628
H  -2.954151 -2.108005 -1.015873
H  -6.465719 -0.960077 1.923702
H  -6.68462 -0.116113 0.272472
