program: Gaussian 09
title: 000094600
version: EM64L-G09RevD.01
frameworkgroup: C1[X(C12H26O2)]
method: RPBEPBE
basis: SDD
operation: Freq
keyword: #pfreq=noraman
keyword: PBEPBE/SDD
title: #p freq=noraman PBEPBE/SDD
converged: YES YES NO NO
title: Mulliken charges:
elementType: O O C C C C C C C C C C C C H H H H H H H H H H H H H H H H H H H H H H H H H H
charge: -0.298033 -0.448639 -0.391773 -0.382489 -0.375766 -0.379015 -0.022098 -0.379277 -0.396220 -0.716303 -0.715623 -0.263798 -0.247228 -0.318628 0.189237 0.203825 0.192688 0.192122 0.188812 0.187973 0.195424 0.194855 0.192257 0.190421 0.191991 0.212903 0.209429 0.203004 0.210403 0.222315 0.205505 0.211881 0.212292 0.190867 0.188487 0.203135 0.186536 0.200966 0.206285 0.351279
chargesum: 0.00000
title: Mulliken charges with hydrogens summed into heavy atoms:
elementType: O O C C C C C C C C C C C C
charge: -0.298033 -0.097360 0.001289 0.002322 0.001019 0.011263 0.170159 0.003135 0.026112 -0.080582 -0.085945 0.115557 0.142442 0.088623
polarizability: 1.83892090e+02 4.05936771e-01 1.21601868e+02 2.12653582e+00 2.62765695e-01 1.16230471e+02
1716.lowfreq: -7.8615 -0.0006 0.0005 0.0007 2.0091 15.6539 20.9525 27.5619 29.3705
frequency: 17.7380 26.5672 29.1147 46.3886 61.4291 76.1289 94.4045 99.1272 116.0274 138.5869 145.4416 152.9088 177.7588 182.3344 210.6980 239.7066 256.2165 314.6932 333.1761 377.4622 403.8520 418.7339 475.6578 479.0122 494.7690 537.8137 722.9950 735.5236 765.2216 807.7093 821.6299 825.3621 871.4970 891.7531 910.1928 935.2087 951.6415 969.9176 975.9083 1003.1312 1005.8605 1024.1382 1035.3435 1059.5387 1065.2477 1072.3074 1081.0474 1088.9869 1099.5900 1138.9827 1151.5074 1175.7687 1182.1452 1190.1752 1204.5777 1215.8523 1218.0915 1251.9505 1256.5060 1274.3715 1282.2093 1288.8441 1291.7213 1296.4465 1315.3957 1327.8524 1331.1405 1335.9705 1347.2671 1353.9969 1358.0911 1373.3342 1386.1922 1390.2635 1399.4120 1455.1301 1458.8872 1461.6196 1463.4064 1464.8003 1468.2375 1469.5827 1472.2905 1477.5844 1481.3325 1484.7928 1488.7969 1491.8618 2914.5484 2934.7010 2943.8617 2950.9898 2951.9682 2953.3407 2958.3904 2963.6110 2963.8903 2965.2768 2966.1940 2969.2324 2986.3563 2989.1252 2992.6072 2996.6146 3001.7731 3021.6592 3039.1779 3056.0178 3056.8814 3062.9841 3066.0262 3073.2281 3079.6073 3531.4307
redmass: 4.0020 2.7786 3.9723 3.9499 1.7913 3.7244 3.1886 1.7295 2.9086 1.8740 2.7560 2.6204 3.7263 2.9912 1.0838 1.0987 2.5958 2.9022 2.6908 2.5958 2.6136 2.2055 1.3601 2.6948 2.1679 2.7264 1.0683 1.1024 1.1606 1.9285 2.1933 1.4768 2.6838 1.2674 1.1975 1.8397 1.3864 2.6808 1.3616 3.4103 4.1387 2.6174 1.3181 3.3594 3.4514 3.3349 2.1720 2.1795 2.0303 2.4647 1.4224 1.7464 1.8366 1.2175 1.2223 1.4607 1.3042 1.3268 1.2630 1.1239 1.0971 1.2272 1.1318 1.1229 1.3419 1.1962 1.4289 1.3418 1.4478 1.6157 1.6318 1.2235 1.2515 1.2175 1.4823 1.0721 1.0876 1.0714 1.0896 1.0742 1.0455 1.0790 1.0639 1.0927 1.0539 1.0904 1.0561 1.0921 1.0548 1.0549 1.0621 1.0594 1.0742 1.0620 1.0615 1.0369 1.1038 1.0581 1.0750 1.0365 1.0958 1.0593 1.0983 1.1009 1.1022 1.1044 1.1047 1.0993 1.1045 1.0993 1.0990 1.0986 1.0965 1.0651
irintensity: 0.4523 1.7541 0.3304 0.4050 0.4037 0.5633 0.4621 0.5506 0.4911 0.9564 3.2566 2.1217 4.3132 4.4023 0.0437 0.0271 0.9262 0.0818 2.2097 0.4325 6.3137 1.8191 128.6974 2.1980 44.5457 8.1820 11.7553 0.7493 2.9930 0.7844 8.7132 5.4673 17.3373 2.1997 3.9027 2.4856 0.5796 19.2159 1.2154 40.0281 11.7012 60.0288 6.8242 11.1125 48.9523 70.3183 6.7377 7.9739 8.1108 1.8473 1.0107 13.1124 2.9755 9.1520 20.4404 1.2393 16.0439 0.8343 0.4865 0.5317 0.0481 0.4330 0.2230 0.0809 0.0521 22.3263 2.8029 15.7466 5.3911 3.1152 2.5869 19.9881 28.8595 14.0137 6.0646 0.4195 13.8917 0.9579 2.4543 0.0941 2.2216 0.2837 4.0855 0.5925 9.0980 3.7948 22.2972 20.3776 39.2127 80.3056 9.2945 1.1840 6.7573 11.9955 1.8730 23.5577 33.7819 174.2467 37.7249 28.3056 2.3252 48.4397 2.6792 98.7273 7.5300 1.4136 96.9075 8.1166 121.0743 79.8493 81.9800 56.9809 41.3602 10.1483
temp: 298.150 k
press: 1.00000 atm
elementType: 8 8 6 6 6 6 6 6 6 6 6 6 6 6 1 1 1 1 1 1 1 1 1 1 1 1 1 1 1 1 1 1 1 1 1 1 1 1 1 1
symmnumber: 1
zpe: 947989.0 jmol-1
zpe.correction: 0.361070 hartree
zpe.thermalcorrener: 0.380028 hartree
zpe.thermalcorrenthalpy: 0.380972 hartree
zpe.thermalcorrgfe: 0.310545 hartree
zpe.sumelectzpe: -622.103316 hartree
zpe.sumelectthermal: -622.084358 hartree
zpe.sumelectthermalent: -622.083414 hartree
zpe.sumelectthermalfe: -622.153841 hartree
dipole: 2.0719 -2.0755 -1.3350
dipole: 3.2223
quadrupole: -110.1904 -90.7738 -90.7213
quadrupole: 13.3916 12.1772 -0.1915
quadrupole: -12.9619 6.4547 6.5072 13.3916 12.1772 -0.1915
hfenergy: -622.4643863 hartree
pointgroup: C01 [X(C12H26O2)]
dipole: 0.8190763 0.7863753 0.5637996 debye
polarizability: 183.8862513|-0.5952203|121.5681491|-2.1666272|0.5312336|116.270028 unknown
InChI: InChI=1S/C12H26O2/c1-12(2)8-6-4-3-5-7-10-14-11-9-13/h12-13H,3-11H2,1-2H3
charge 0 multiplicity 1
40 atoms
O  -4.414062 -0.084062 0.288352
O  -6.678426 -1.016426 -1.097013
C  3.150956 -0.309741 -0.119522
C  1.901978 0.594803 -0.011468
C  4.47587 0.486504 -0.116166
C  0.57626 -0.198681 0.004567
C  5.754265 -0.367301 -0.336031
C  -0.6748 0.7005 0.12506
C  -1.992133 -0.108481 0.138365
C  5.974812 -1.394675 0.800415
C  6.994063 0.547096 -0.484885
C  -3.227889 0.784023 0.281086
C  -5.678792 0.659033 0.409863
C  -6.783323 -0.382317 0.219723
H  3.087701 -0.910735 -1.051335
H  3.141998 -1.033159 0.720279
H  1.973708 1.208424 0.911228
H  1.892485 1.310504 -0.860163
H  4.42639 1.259929 -0.911643
H  4.573236 1.035333 0.845268
H  0.502256 -0.807278 -0.920775
H  0.590749 -0.918458 0.849382
H  5.624985 -0.928874 -1.286727
H  -0.599882 1.3052 1.053192
H  -0.688095 1.422259 -0.718252
H  -1.981085 -0.834017 0.974591
H  -2.082727 -0.696703 -0.795595
H  6.067566 -0.879315 1.776555
H  6.903086 -1.972942 0.634872
H  5.140353 -2.114883 0.874123
H  7.16134 1.130613 0.44155
H  7.908437 -0.044106 -0.679619
H  6.868161 1.264838 -1.317402
H  -3.295783 1.506823 -0.563353
H  -3.184625 1.3657 1.229443
H  -5.73799 1.436164 -0.382828
H  -5.751589 1.148615 1.405921
H  -6.717542 -1.138438 1.030257
H  -7.777061 0.095101 0.252043
H  -5.72655 -1.281166 -1.199659
