program: Gaussian 09
title: 000009269
version: EM64L-G09RevD.01
frameworkgroup: C1[X(C8H16O4)]
method: RPBEPBE
basis: SDD
operation: Freq
keyword: #pfreq=noraman
keyword: PBEPBE/SDD
title: #p freq=noraman PBEPBE/SDD
converged: YES YES NO NO
title: Mulliken charges:
elementType: O O O O C C C C C C C C H H H H H H H H H H H H H H H H
charge: -0.238233 -0.238244 -0.238247 -0.238234 -0.239167 -0.294943 -0.294950 -0.239172 -0.239173 -0.294951 -0.294943 -0.239166 0.170944 0.193900 0.243066 0.164441 0.243061 0.164442 0.170950 0.193907 0.170950 0.193907 0.243062 0.164442 0.243065 0.164441 0.170944 0.193901
chargesum: 0.00000
title: Mulliken charges with hydrogens summed into heavy atoms:
elementType: O O O O C C C C C C C C
charge: -0.238233 -0.238244 -0.238247 -0.238234 0.125677 0.112563 0.112553 0.125686 0.125684 0.112553 0.112563 0.125679
polarizability: 1.10559073e+02 -5.69158852e-04 1.10559296e+02 -6.24413155e-04 -9.23979434e-05 8.01375248e+01
1716.lowfreq: -13.4113 -0.0009 -0.0007 0.0002 11.8846 11.9014 18.8320 73.1993 116.4558
frequency: 18.8320 73.1993 116.4558 184.7226 187.9664 187.9906 233.3323 242.0970 242.1116 289.1983 306.2906 328.5108 328.5211 388.4077 450.5046 522.7751 522.7893 565.8119 755.8826 764.0273 764.0422 779.4087 884.0225 888.6986 892.0583 892.0677 997.1877 997.7015 997.7160 1003.9733 1040.3978 1074.3282 1074.3417 1086.4786 1092.8105 1106.7309 1106.7375 1135.0747 1188.9615 1209.3639 1209.3729 1222.0432 1244.8357 1264.8171 1264.8263 1281.0826 1341.6892 1356.6366 1356.6452 1360.1274 1370.6838 1372.5760 1372.5810 1381.4281 1439.0218 1439.9330 1439.9336 1440.3465 1457.4257 1470.7734 1470.7844 1489.9349 2909.5230 2910.2169 2910.2494 2910.5072 2929.8378 2934.9296 2934.9536 2942.6758 2962.7686 2968.3762 2968.4233 2978.3854 3081.9623 3081.9656 3081.9928 3082.1099
redmass: 3.4610 4.6129 3.7509 4.5604 4.7667 4.7663 7.5572 2.4562 2.4560 2.2784 1.7661 2.1163 2.1164 2.4489 2.3497 2.7077 2.7076 2.7340 2.4819 2.8222 2.8221 3.5748 2.5804 1.9250 2.2454 2.2454 2.3673 2.4911 2.4912 2.3343 3.6996 3.0028 3.0028 2.6951 4.0544 2.7079 2.7083 2.4627 1.0977 1.1478 1.1477 1.1473 1.1260 1.1481 1.1481 1.1329 1.3109 1.2600 1.2600 1.3347 1.2400 1.3068 1.3069 1.2646 1.0830 1.0868 1.0868 1.0870 1.0872 1.0793 1.0793 1.0768 1.0576 1.0598 1.0598 1.0614 1.0689 1.0687 1.0687 1.0694 1.1018 1.0986 1.0986 1.0956 1.0931 1.0931 1.0935 1.0927
irintensity: 0.0000 0.0000 0.0000 0.0000 18.6052 18.6081 0.7782 1.7384 1.7382 0.0626 11.4029 7.3422 7.3474 0.0000 0.0000 16.7467 16.7437 0.2711 0.0000 0.8162 0.8170 21.4758 0.0000 0.6387 46.3052 46.3026 0.0000 8.2456 8.2584 33.5709 0.3701 133.8724 133.8430 5.9185 0.0000 32.3316 32.3517 0.0000 0.1622 25.6337 25.6267 0.0000 0.0000 23.2669 23.2623 1.9251 7.5812 14.1756 14.1869 0.6700 0.0000 5.0159 5.0093 0.0000 0.0000 14.1140 14.1183 0.3992 0.0000 15.4358 15.4433 9.8453 0.0123 1.0096 1.0070 42.2835 0.0002 249.5424 249.5885 166.5904 0.0002 106.5633 106.5920 56.2762 19.4349 19.4250 0.0309 46.1018
temp: 298.150 k
press: 1.00000 atm
elementType: 8 8 8 8 6 6 6 6 6 6 6 6 1 1 1 1 1 1 1 1 1 1 1 1 1 1 1 1
symmnumber: 1
zpe: 625395.1 jmol-1
zpe.correction: 0.238200 hartree
zpe.thermalcorrener: 0.250644 hartree
zpe.thermalcorrenthalpy: 0.251588 hartree
zpe.thermalcorrgfe: 0.199082 hartree
zpe.sumelectzpe: -614.252289 hartree
zpe.sumelectthermal: -614.239846 hartree
zpe.sumelectthermalent: -614.238902 hartree
zpe.sumelectthermalfe: -614.291408 hartree
dipole: 0.0002 0.0000 5.8592
dipole: 5.8592
quadrupole: -66.6264 -66.6225 -75.9442
quadrupole: -0.0008 -0.0002 0.0000
quadrupole: 3.1046 3.1086 -6.2132 -0.0008 -0.0002 0.0000
hfenergy: -614.4904898 hartree
pointgroup: C01 [X(C8H16O4)]
dipole: 0.0000653 -0.000036 2.3051959 debye
polarizability: 110.5586258|-0.000156|110.559743|-0.00058|0.000249|80.1375248 unknown
InChI: InChI=1S/C8H16O4/c1-2-10-5-6-12-8-7-11-4-3-9-1/h1-8H2
charge 0 multiplicity 1
28 atoms
O  0.855957 1.945436 -0.514444
O  1.945712 -0.856079 -0.514413
O  -1.945701 0.856046 -0.514313
O  -0.855915 -1.945488 -0.514441
C  1.709208 1.422615 0.549762
C  -0.355709 2.63068 -0.057757
C  2.630779 0.355688 -0.057733
C  -1.422677 1.709238 0.549858
C  1.422763 -1.709307 0.549766
C  -2.630724 -0.355746 -0.057632
C  0.355766 -2.630744 -0.05781
C  -1.709124 -1.422677 0.549806
H  1.111211 0.993863 1.382155
H  2.338215 2.238294 0.976305
H  -0.763803 3.099342 -0.968742
H  -0.108524 3.428361 0.680376
H  3.09946 0.763772 -0.968712
H  3.428435 0.10864 0.680477
H  -0.9939 1.111198 1.382202
H  -2.238254 2.338325 0.976465
H  0.994028 -1.111293 1.38215
H  2.238372 -2.338398 0.97631
H  -3.099434 -0.763813 -0.968604
H  -3.428361 -0.108726 0.680608
H  0.763823 -3.0994 -0.968815
H  0.10861 -3.428425 0.680333
H  -1.111094 -0.99394 1.382183
H  -2.33812 -2.238359 0.976358
