program: Gaussian 09
title: 000094632
version: EM64L-G09RevD.01
frameworkgroup: C1[X(C19H22N5O)]
method: RPBEPBE
basis: SDD
operation: Freq
keyword: #p
keyword: freq=noraman
keyword: PBEPBE/SDD
title: #p freq=noraman PBEPBE/SDD
converged: YES YES NO NO
title: Mulliken charges:
elementType: O N N N N N C C C C C C C C C C C C C C C C C C C H H H H H H H H H H H H H H H H H H H H H H
charge: -0.194739 -0.233833 -0.267806 -0.011202 -0.041404 -0.077716 0.563008 -0.555741 -0.555620 -0.592691 -0.486875 -0.354486 -0.443708 0.168584 -0.215422 0.220885 0.169282 -0.281295 0.432615 -0.758819 -0.347039 -0.379434 -0.216456 -0.198259 -0.239257 0.272496 0.281338 0.260439 0.272586 0.259900 0.284530 0.265976 0.278887 0.282379 0.287737 0.246178 0.299951 0.259857 0.303266 0.242543 0.266399 0.247578 0.290428 0.282110 0.234918 0.237829 0.240105
chargesum: 1.00000
title: Mulliken charges with hydrogens summed into heavy atoms:
elementType: O N N N N N C C C C C C C C C C C C C C C C C C C
charge: -0.194739 -0.233833 -0.267806 -0.011202 -0.041404 -0.077716 0.563008 0.258532 0.261396 0.234551 -0.199138 -0.108308 -0.143757 0.168584 0.044435 0.220885 0.169282 0.021971 0.432615 -0.002299 -0.056610 -0.097324 0.018462 0.039570 0.000848
polarizability: 4.98149445e+02 -1.41826609e+01 2.22133010e+02 1.82657720e+00 6.48209705e+00 1.69448615e+02
1716.lowfreq: -10.5796 -2.6159 -1.0315 -0.0011 -0.0008 0.0005 3.4844 19.2334 29.2717
frequency: -5.3648 19.1967 29.2529 37.0534 50.6884 76.6179 95.2165 103.0438 134.3771 138.8746 144.6350 149.5363 186.5505 219.5736 233.0457 249.3933 259.4150 277.2328 287.6431 302.7876 313.8038 327.7351 333.9840 348.7450 359.8453 373.4431 388.2959 408.3159 408.9449 438.2127 468.6788 494.4032 509.8053 534.3701 543.6161 568.7226 602.5761 613.0815 623.0179 647.3560 658.7173 686.8172 698.3040 698.6346 723.6420 772.2340 786.6172 799.0478 806.8919 855.0232 873.0345 894.1607 905.9744 924.2223 933.0394 935.2561 935.9673 937.0558 979.9631 986.2980 987.0641 989.8552 1003.9840 1010.1734 1023.4944 1030.9136 1043.1474 1045.2949 1056.7572 1078.1704 1098.7802 1103.6213 1106.7957 1110.9607 1117.6138 1161.6201 1168.1902 1177.1125 1194.1054 1202.0981 1212.8463 1220.8564 1247.4207 1252.1444 1292.3904 1300.8986 1328.5130 1355.5713 1377.4645 1384.6272 1393.8503 1401.6645 1418.7462 1421.9220 1438.5005 1448.8615 1451.3996 1452.1578 1453.1566 1454.9627 1461.9318 1463.7963 1474.1593 1479.5624 1481.7787 1485.9133 1500.2694 1581.1916 1583.9455 1595.9966 1605.8778 1607.0036 1642.7879 2982.0928 2984.9747 3029.7513 3031.3005 3034.9767 3058.9415 3117.3804 3139.1493 3144.2992 3144.7966 3146.7983 3149.7691 3151.3110 3157.2803 3162.6880 3164.3864 3167.2957 3168.6690 3182.2716 3184.0414 3188.8097 3193.0054
redmass: 4.4646 4.6135 4.0985 3.6743 5.0050 5.6925 5.1154 4.2114 2.9782 4.1290 2.0334 1.5829 1.0934 4.2566 3.5527 3.7099 1.2119 4.6463 4.5878 3.8626 2.7130 1.4135 3.4397 4.9237 3.0494 5.1782 5.0342 2.9457 2.5655 4.0196 3.2415 4.0445 3.5244 4.4632 3.9664 4.5992 5.9663 6.4624 5.4747 6.4089 6.0701 2.9093 3.5163 2.3509 6.1112 1.6050 5.5809 3.9550 1.4909 1.2412 4.1061 4.6194 2.1985 1.8942 2.6087 2.6202 1.5430 1.4236 2.1957 5.8699 6.0587 1.3753 1.3132 1.3617 2.7023 2.2855 2.4828 1.1923 3.8381 1.6650 1.7316 1.3053 1.3874 1.5624 3.2783 2.2376 1.4255 1.0530 1.1347 1.4018 1.8618 1.8323 1.6934 2.0331 2.0760 1.7545 1.3373 3.4051 11.0391 9.4962 8.1895 1.3967 1.1445 1.1361 2.7013 2.0936 1.0659 1.1804 1.1770 1.0482 1.3992 1.0789 1.3473 1.0882 2.3268 1.0457 1.0575 6.1809 6.8149 6.7546 6.6663 6.0091 12.2846 1.0539 1.0648 1.0321 1.0321 1.0330 1.0970 1.0984 1.0860 1.1050 1.1041 1.0916 1.0910 1.1054 1.1053 1.1053 1.0984 1.0981 1.0970 1.0965 1.0933 1.0947 1.0961
irintensity: 2.4308 1.2560 1.5992 0.1347 2.2782 1.0339 1.1669 1.5632 0.9237 3.5184 1.2627 1.6424 0.0131 2.2961 3.5129 2.6222 0.5808 0.0197 2.1425 4.6626 1.7492 0.0454 2.2767 5.2915 0.9148 1.6759 1.6907 0.0222 0.1295 4.0631 5.1026 1.9638 15.3039 17.9999 8.4778 3.6846 7.1021 0.1143 4.6195 24.3372 7.3599 10.4743 31.0239 40.1255 2.4337 84.5914 4.0067 32.4088 34.0160 3.0336 44.8066 61.3204 7.0393 30.9265 4.0352 13.3173 2.0566 11.9555 37.5938 0.3253 5.2442 0.3198 2.2144 0.7844 6.1475 11.2487 9.5489 0.0482 92.7347 4.4265 31.5322 0.3734 5.5620 2.7173 53.1381 7.9828 5.4403 0.1332 4.7079 1.7072 0.0360 0.2453 5.7015 27.5547 121.2934 28.8090 0.5949 5.4505 251.5780 1.6913 0.5835 29.6276 16.0457 18.2624 41.8252 6.6734 0.9103 23.6851 3.3336 21.3014 18.8440 5.7767 21.3171 44.3012 97.3794 35.5302 96.9462 2.0543 16.4675 7.3812 51.0793 14.9390 152.9454 6.3315 9.4422 2.5899 4.1504 4.9637 8.3963 4.8571 0.6439 0.4890 0.8077 4.3151 14.7596 22.8872 0.7880 0.9863 1.2344 4.3327 29.5277 2.2553 4.3375 1.4159 4.5988
temp: 298.150 k
press: 1.00000 atm
elementType: 8 7 7 7 7 7 6 6 6 6 6 6 6 6 6 6 6 6 6 6 6 6 6 6 6 1 1 1 1 1 1 1 1 1 1 1 1 1 1 1 1 1 1 1 1 1 1
symmnumber: 1
zpe: 997433.7 jmol-1
zpe.correction: 0.379902 hartree
zpe.thermalcorrener: 0.402492 hartree
zpe.thermalcorrenthalpy: 0.403436 hartree
zpe.thermalcorrgfe: 0.327349 hartree
zpe.sumelectzpe: -1084.075362 hartree
zpe.sumelectthermal: -1084.052772 hartree
zpe.sumelectthermalent: -1084.051828 hartree
zpe.sumelectthermalfe: -1084.127915 hartree
dipole: -22.6286 -0.3943 -0.6485
dipole: 22.6413
quadrupole: 33.2833 -124.7608 -131.8904
quadrupole: 21.5080 7.1526 0.1563
quadrupole: 107.7393 -50.3048 -57.4344 21.5080 7.1526 0.1563
hfenergy: -1084.455264 hartree
pointgroup: C01 [X(C19H22N5O1)]
dipole: -8.8949513 -0.1976685 -0.4349708 debye
polarizability: 494.4945517|17.9464088|204.8696524|30.0612688|27.5163024|190.3668661 unknown
InChI: InChI=1S/C19H22N5O/c1-14-18(19(25)23(22-14)16-10-6-5-7-11-16)21-20-15-9-8-12-17(13-15)24(2,3)4/h5-13,18H,1-4H3
charge 1 multiplicity 1
47 atoms
O  1.372956 0.58865 1.32657
N  -5.944898 0.128047 0.078098
N  3.161264 -0.554871 0.207526
N  3.318203 -1.766783 -0.549164
N  -0.051448 -1.199721 -0.69836
N  -1.175002 -1.171787 -0.039929
C  -4.635838 -0.04116 -0.70032
C  -7.047968 -0.715992 -0.577585
C  -6.352786 1.609754 0.074723
C  -5.822276 -0.317511 1.535579
C  -3.485576 -0.539975 -0.067847
C  -4.616723 0.327019 -2.065892
C  1.064478 -1.628557 0.155536
C  -2.2854 -0.664042 -0.81191
C  -3.413544 0.191393 -2.79623
C  2.149598 -2.371699 -0.610109
C  1.851131 -0.358526 0.658326
C  -2.244831 -0.297236 -2.180895
C  4.321499 0.261023 0.43075
C  1.949774 -3.651583 -1.357022
C  4.215964 1.482732 1.145164
C  5.572772 -0.174783 -0.075398
C  5.375124 2.262367 1.344015
C  6.71744 0.619964 0.13494
C  6.627848 1.840501 0.843891
H  -7.194341 -0.387167 -1.615062
H  -6.735158 -1.770386 -0.566193
H  -7.981093 -0.584358 -0.008054
H  -6.509406 1.944611 -0.959507
H  -7.284069 1.722741 0.651277
H  -5.54232 2.195716 0.532455
H  -6.800551 -0.173177 2.018388
H  -5.545624 -1.380752 1.573036
H  -5.065403 0.294653 2.04623
H  -3.436531 -0.837252 0.982069
H  -5.502031 0.716353 -2.579196
H  0.708817 -2.176774 1.052432
H  -3.398217 0.477623 -3.852227
H  -1.303794 -0.394134 -2.729849
H  1.574891 -4.449978 -0.689298
H  2.897667 -3.984475 -1.807883
H  1.200423 -3.518958 -2.159947
H  3.252114 1.811322 1.539372
H  5.633875 -1.116978 -0.623518
H  5.294239 3.204363 1.896746
H  7.682589 0.282398 -0.257213
H  7.521462 2.451986 1.005388
