program: Gaussian 09
title: 000094593
version: EM64L-G09RevD.01
frameworkgroup: C1[X(C8H13N3O4)]
method: RPBEPBE
basis: SDD
operation: Freq
keyword: #p
keyword: freq=noraman
keyword: PBEPBE/SDD
title: #p freq=noraman PBEPBE/SDD
converged: YES YES NO NO
title: Mulliken charges:
elementType: O O O O N N N C C C C C C C C H H H H H H H H H H H H H
charge: -0.481123 -0.303702 -0.209996 -0.251397 -0.192596 -0.091144 0.045034 -0.429212 -0.035071 -0.307566 0.264234 0.318529 -0.355778 -0.775299 -0.487420 0.261690 0.238720 0.249311 0.203342 0.224781 0.289021 0.296088 0.230338 0.266690 0.371143 0.238511 0.207177 0.215696
chargesum: 0.00000
title: Mulliken charges with hydrogens summed into heavy atoms:
elementType: O O O O N N N C C C C C C C C
charge: -0.109980 -0.303702 -0.209996 -0.251397 -0.192596 -0.091144 0.045034 0.071198 0.214240 0.120557 0.264234 0.318529 -0.066756 0.017817 0.173963
polarizability: 1.48961110e+02 3.47537940e+00 1.52225056e+02 -1.34264269e+01 1.28277971e+00 8.06905034e+01
1716.lowfreq: -5.7210 -3.2011 0.0007 0.0010 0.0011 3.1662 28.2928 41.0144 59.2650
frequency: 28.0844 40.9966 59.2523 79.1882 85.8557 110.2442 117.1199 162.7031 182.6138 212.7744 220.2237 249.9889 269.7624 298.6228 347.8622 354.3798 375.0380 418.1144 451.5281 488.3010 541.6519 553.8730 604.4563 661.5562 680.0160 690.7564 750.5010 758.9805 836.6733 868.2111 885.5909 899.8346 952.7039 993.7972 1042.2186 1055.5784 1062.0445 1080.0582 1099.5804 1119.4389 1130.0302 1157.2738 1174.4955 1193.6865 1212.7737 1234.3405 1260.0442 1304.3688 1313.0262 1325.5108 1331.0618 1360.8597 1365.5308 1396.9035 1401.6741 1409.6760 1438.2255 1450.7916 1459.8276 1461.4074 1465.5214 1469.3629 1478.0135 1482.6284 1493.6260 2932.7126 2943.1098 2983.9099 2992.3169 3012.6707 3022.4714 3050.0827 3068.7490 3112.4671 3118.7643 3127.9985 3251.4594 3509.7014
redmass: 4.3368 6.0136 5.3389 4.2726 3.7477 2.8861 3.4490 3.9014 1.0370 3.5467 1.5109 4.6004 7.8947 4.4800 3.0640 2.7765 4.1704 6.7515 2.1736 1.2075 3.9762 2.9869 4.5743 4.9562 5.3992 7.6921 8.5371 5.2505 3.4564 1.4335 3.2571 3.1771 2.2113 1.8184 2.4541 1.5456 5.2108 2.1829 4.1340 1.4229 2.5163 1.4625 2.6173 1.2656 2.6375 1.6293 1.4122 1.3144 4.0620 3.9186 2.3058 1.5242 1.2975 1.2790 1.9043 2.6310 1.1439 1.1921 1.0508 1.0915 2.7999 1.3316 1.1283 1.8831 1.7162 1.0543 1.0370 1.0405 1.0902 1.0978 1.1032 1.0607 1.0950 1.0987 1.1038 1.0983 1.0994 1.0647
irintensity: 3.7258 0.7847 2.9585 0.1734 3.3483 2.0867 2.1227 0.5037 0.2343 5.3375 3.2234 5.6796 6.7921 2.9127 7.5042 1.5837 4.7837 2.1113 31.3865 128.8917 26.2119 21.5814 5.8888 7.0468 6.6377 5.7755 4.8035 6.5196 16.5224 22.4345 21.3437 6.4507 4.2454 0.2670 33.5950 14.7016 99.5109 6.3877 56.4144 7.1602 39.9147 6.1637 211.9185 0.3020 0.6626 22.8637 81.9102 26.4174 57.2787 260.2672 38.8845 6.9797 4.7492 7.9772 4.0514 72.4985 0.2323 21.1401 13.1988 25.6519 137.1780 72.8916 12.3531 5.6303 18.9024 42.5159 86.0999 11.8870 3.9141 63.9994 50.4272 23.5161 4.8986 24.7520 1.6085 2.9146 2.1851 33.6637
temp: 298.150 k
press: 1.00000 atm
elementType: 8 8 8 8 7 7 7 6 6 6 6 6 6 6 6 1 1 1 1 1 1 1 1 1 1 1 1 1
symmnumber: 1
zpe: 571738.7 jmol-1
zpe.correction: 0.217764 hartree
zpe.thermalcorrener: 0.233425 hartree
zpe.thermalcorrenthalpy: 0.234369 hartree
zpe.thermalcorrgfe: 0.173308 hartree
zpe.sumelectzpe: -776.521816 hartree
zpe.sumelectthermal: -776.506155 hartree
zpe.sumelectthermalent: -776.505211 hartree
zpe.sumelectthermalfe: -776.566272 hartree
dipole: -5.3334 2.5514 2.4486
dipole: 6.3993
quadrupole: -81.3511 -100.9582 -86.1018
quadrupole: 4.3936 -0.6464 2.7079
quadrupole: 8.1193 -11.4878 3.3685 4.3936 -0.6464 2.7079
hfenergy: -776.73958 hartree
pointgroup: C01 [X(C8H13N3O4)]
dipole: -2.1364514 -0.959089 -0.9243133 debye
polarizability: 149.3146497|-3.4110607|152.36011|12.1190543|1.2237383|80.2019097 unknown
InChI: InChI=1S/C8H13N3O4/c1-6-9-3-8(11(13)14)10(6)4-7(12)5-15-2/h3,7,12H,4-5H2,1-2H3
charge 0 multiplicity 1
28 atoms
O  -1.709747 -1.541238 0.662165
O  -3.754742 0.229085 0.613457
O  2.501623 2.749649 0.244754
O  0.377225 2.333762 -0.510976
N  0.956752 -0.494013 -0.43706
N  2.86091 -1.459739 0.36139
N  1.557338 1.936675 -0.108539
C  -0.405628 -0.37062 -0.999405
C  -1.477995 -0.207823 0.088929
C  -2.789541 0.346902 -0.48626
C  1.619284 -1.687521 -0.169387
C  1.83354 0.539533 -0.038653
C  2.997551 -0.087276 0.44218
C  1.038683 -3.041287 -0.418613
C  -5.10516 0.650456 0.240081
H  -0.426111 0.495016 -1.677454
H  -0.622078 -1.291017 -1.566799
H  -1.120783 0.49011 0.872101
H  -3.130848 -0.255119 -1.357982
H  -2.662601 1.406457 -0.791428
H  3.889946 0.392909 0.834144
H  0.043554 -3.132532 0.050741
H  0.930489 -3.253216 -1.499838
H  1.722334 -3.789619 0.009194
H  -2.538541 -1.467937 1.20726
H  -5.731053 0.511626 1.13492
H  -5.503665 0.034161 -0.59276
H  -5.120836 1.71832 -0.05876
