program: Gaussian 09
title: 000094610
version: EM64L-G09RevD.01
frameworkgroup: C1[X(C9H3F13O4)]
method: RPBEPBE
basis: SDD
operation: Freq
keyword: #p
keyword: freq=noraman
keyword: PBEPBE/SDD
title: #p freq=noraman PBEPBE/SDD
converged: YES YES NO NO
title: Mulliken charges:
elementType: F F F F F F F F F F F F F O O O O C C C C C C C C C H H H
charge: -0.110960 -0.128153 -0.123053 -0.119868 -0.125903 -0.117170 -0.114643 -0.126227 -0.144264 -0.128764 -0.128085 -0.130446 -0.126727 -0.282193 -0.237047 -0.248008 -0.170696 0.199945 0.355283 0.371054 0.385501 0.197520 0.235308 0.234880 -0.493718 0.313259 0.250736 0.255484 0.256955
chargesum: 0.00000
title: Mulliken charges with hydrogens summed into heavy atoms:
elementType: F F F F F F F F F F F F F O O O O C C C C C C C C C
charge: -0.110960 -0.128153 -0.123053 -0.119868 -0.125903 -0.117170 -0.114643 -0.126227 -0.144264 -0.128764 -0.128085 -0.130446 -0.126727 -0.282193 -0.237047 -0.248008 -0.170696 0.199945 0.355283 0.371054 0.385501 0.197520 0.235308 0.234880 0.269457 0.313259
polarizability: 1.34638223e+02 1.17671480e+01 1.09454977e+02 -6.42128739e+00 9.96240927e-01 1.12265722e+02
1716.lowfreq: -2.8198 -0.0004 -0.0004 0.0004 1.7965 3.7374 12.6346 17.2742 20.6939
frequency: 12.4391 17.1801 20.6871 27.5038 30.3761 43.9821 49.8378 58.8644 67.2817 73.9230 78.1075 119.2865 123.4627 143.3624 155.0757 169.5489 184.1274 193.7681 204.6769 217.1858 217.7819 230.3929 260.4387 274.2255 280.3414 293.3375 294.9611 301.3112 331.2574 333.0221 337.8699 376.8007 406.8440 418.2601 453.7060 459.6271 480.8295 489.1673 493.9835 518.7688 532.2820 532.7673 560.3713 563.8242 622.2155 658.3709 683.9003 703.1106 713.3693 736.1485 754.6963 885.4266 890.6435 943.7623 984.1993 997.1974 1000.8260 1016.0216 1025.5597 1034.3216 1054.1412 1069.0597 1081.0407 1086.3002 1090.5626 1115.7832 1153.2256 1163.7046 1178.2984 1192.0152 1208.0072 1210.4507 1218.7247 1422.4780 1455.0467 1457.7612 1675.8486 1778.9816 3016.0467 3124.7629 3170.3668
redmass: 9.5643 11.0390 14.7211 11.5921 5.6108 18.0805 7.8728 16.1565 17.5590 2.1596 2.1105 6.9305 17.0623 5.5010 12.8245 15.9065 17.6856 14.6301 16.7548 14.4743 10.3855 17.8270 11.7719 16.5792 17.0691 11.6816 9.8392 16.9549 15.8319 10.6651 14.9894 14.0055 16.3004 14.5885 17.3992 16.9996 15.4872 15.8436 17.0840 15.6156 16.6092 14.4687 16.1901 15.9994 15.8617 16.1861 11.8186 15.4736 16.4472 10.0933 9.4514 10.3965 12.8626 11.4108 13.1157 12.7471 13.0142 12.0367 12.7363 12.7998 13.0692 13.5693 11.5508 11.6042 12.9516 1.2696 1.4777 12.1228 11.5384 12.0503 13.0213 10.1765 12.0329 1.1737 1.0489 1.0501 11.0476 12.1312 1.0292 1.1058 1.1055
irintensity: 0.7083 0.3624 0.1063 0.5360 0.6327 0.1143 0.9961 0.1691 0.0927 0.4086 0.3149 0.5513 0.3057 1.8846 0.7996 0.5842 0.9976 6.4832 2.1228 0.9203 3.3263 1.4709 3.1593 2.2401 1.1994 1.9370 10.3093 2.3169 1.6751 4.1358 2.7319 4.4463 4.2155 18.8135 1.5171 20.2519 2.1160 2.1284 1.8087 9.1378 11.9025 8.9454 9.6617 4.1064 29.2352 31.8271 46.9006 2.5141 10.8763 22.1422 15.0180 19.9988 113.9726 64.6050 15.2721 14.5984 139.8903 76.2541 42.1620 116.7808 420.7440 147.4811 317.5618 600.2939 581.2163 1.2473 12.0229 90.8784 27.5675 119.8419 296.5328 59.8579 25.4443 13.7666 19.0049 12.9805 207.2284 18.0965 14.9781 16.9887 6.7252
temp: 298.150 k
press: 1.00000 atm
elementType: 9 9 9 9 9 9 9 9 9 9 9 9 9 8 8 8 8 6 6 6 6 6 6 6 6 6 1 1 1
symmnumber: 1
zpe: 340967.0 jmol-1
zpe.correction: 0.129867 hartree
zpe.thermalcorrener: 0.157010 hartree
zpe.thermalcorrenthalpy: 0.157954 hartree
zpe.thermalcorrgfe: 0.067016 hartree
zpe.sumelectzpe: -1941.485058 hartree
zpe.sumelectthermal: -1941.457915 hartree
zpe.sumelectthermalent: -1941.456971 hartree
zpe.sumelectthermalfe: -1941.547909 hartree
dipole: -2.4661 -3.4804 -0.1879
dipole: 4.2697
quadrupole: -153.6373 -130.8326 -152.9440
quadrupole: -6.8579 0.7349 2.3592
quadrupole: -7.8326 14.9720 -7.1394 -6.8579 0.7349 2.3592
hfenergy: -1941.6149255 hartree
pointgroup: C01 [X(C9H3F13O4)]
dipole: 0.7468086 1.5016906 0.0948756 debye
polarizability: 130.8538391|14.1440481|113.6863779|7.8062873|-0.2131476|111.8187047 unknown
InChI: InChI=1S/C9H3F13O4/c1-24-4(23)5(13,14)8(19,20)26-6(15,7(16,17)18)9(21,22)25-3(12)2(10)11/h1H3
charge 0 multiplicity 1
29 atoms
F  0.570782 -1.528122 1.322229
F  0.578544 1.139486 -1.176104
F  0.839003 1.174663 1.066426
F  -1.746246 -0.065788 2.104825
F  -2.195774 -2.149666 1.361882
F  1.848706 -2.63273 -0.806821
F  -0.36135 -3.06858 -0.999092
F  0.595636 -1.485379 -2.316664
F  -4.372118 -0.169833 1.422048
F  -3.94065 -1.330259 -0.497083
F  3.565133 1.609007 -1.593032
F  5.102166 2.442304 0.631051
F  3.951426 1.026025 2.003577
O  -1.134519 -0.64248 -0.087659
O  2.433916 0.060288 -0.231659
O  -2.739351 1.959151 0.301105
O  -3.880042 1.177691 -1.587966
C  0.256644 -0.966852 0.055067
C  1.059991 0.377443 -0.083421
C  -2.089615 -0.800994 0.951988
C  0.598692 -2.054542 -1.035724
C  -3.453755 -0.312275 0.345201
C  -3.390703 1.020037 -0.459418
C  3.35634 1.10602 -0.317787
C  -2.591337 3.311299 -0.306732
C  4.106345 1.506953 0.730065
H  -2.081215 3.903276 0.463567
H  -3.585609 3.723867 -0.542473
H  -1.985939 3.236289 -1.224695
