program: Gaussian 09
title: 000094687
version: EM64L-G09RevD.01
frameworkgroup: C1[X(C25H32OS)]
method: RPBEPBE
basis: SDD
operation: Freq
keyword: #p
keyword: freq=noraman
keyword: PBEPBE/SDD
title: #p freq=noraman PBEPBE/SDD
converged: YES YES NO NO
title: Mulliken charges:
elementType: S O C C C C C C C C C C C C C C C C C C C C C C C C C H H H H H H H H H H H H H H H H H H H H H H H H H H H H H H H H
charge: 0.215971 -0.255739 -0.385175 -0.385834 -0.389765 -0.384760 -0.365312 -0.381978 -0.392091 -0.372731 -0.574444 -0.353223 0.526279 -0.356727 -0.550063 0.385852 -0.401740 -0.332902 -0.696661 -0.295135 0.047931 0.378793 -0.313881 -0.339869 -0.293162 -0.247349 -0.221283 0.195528 0.192739 0.195069 0.192866 0.198293 0.193755 0.192149 0.194000 0.197584 0.191234 0.192647 0.191278 0.217656 0.206313 0.189873 0.188752 0.206224 0.218794 0.187956 0.187179 0.194442 0.195016 0.289937 0.242543 0.209500 0.209737 0.214926 0.243201 0.286780 0.245873 0.237180 0.235978
chargesum: 0.00000
title: Mulliken charges with hydrogens summed into heavy atoms:
elementType: S O C C C C C C C C C C C C C C C C C C C C C C C C C
charge: 0.215971 -0.255739 0.003092 0.002100 0.002283 0.001389 0.023505 0.001947 0.031878 0.005894 -0.149426 0.021911 0.526279 0.032730 -0.260126 0.385852 -0.159197 -0.332902 -0.062498 -0.051934 0.047931 0.378793 -0.313881 -0.053089 -0.047289 -0.010169 0.014695
polarizability: 4.38055095e+02 -4.90313232e+01 2.71932916e+02 4.50514148e+01 2.79733481e+01 2.09150779e+02
1716.lowfreq: -36.3490 -9.1050 -3.7619 -2.4547 -0.0021 -0.0015 -0.0014 6.2611 8.1640
frequency: -32.8016 -6.9442 6.0055 17.1085 28.4353 39.0443 43.7205 47.3121 77.5396 81.9610 87.0484 99.4858 118.1645 122.0651 127.5803 138.3231 144.8236 146.3850 154.2357 183.0809 200.3000 220.8166 224.9533 246.8797 273.5457 294.3979 329.3795 342.0537 368.3756 386.2183 406.2840 414.1274 416.5412 436.6324 447.9594 459.1991 480.4910 492.0382 494.2319 558.3433 590.9068 627.2053 658.8656 678.0402 695.4654 717.0707 719.5670 724.2163 727.5206 734.2872 735.7420 753.5310 758.1810 785.2445 806.4981 825.7126 828.1422 839.2435 877.8658 884.6951 886.4589 929.4103 949.0781 967.2360 974.2749 976.1173 979.4743 983.8282 986.4570 1008.5532 1015.9603 1020.8829 1022.7273 1028.0292 1045.7195 1049.9874 1056.0513 1066.8332 1072.4108 1078.0226 1079.2659 1082.6098 1088.0758 1119.1063 1122.0218 1136.0960 1161.8187 1173.6377 1180.3587 1195.9203 1199.5287 1214.8528 1223.7603 1226.3328 1235.9714 1248.2964 1252.3730 1265.3945 1269.9912 1273.3858 1277.5586 1279.0373 1283.9859 1287.1299 1292.0995 1293.0885 1299.7527 1303.7666 1322.0215 1336.7345 1347.1383 1349.9075 1352.8486 1353.0286 1384.3981 1385.9867 1388.7934 1403.5013 1424.5205 1454.3620 1456.9353 1457.0997 1460.3128 1460.8887 1462.7895 1464.4178 1466.5714 1469.6214 1474.2413 1475.4273 1478.9603 1483.2952 1486.2888 1488.1926 1524.7171 1556.8638 1577.8682 1602.5323 1615.5372 2946.9165 2946.9860 2948.6228 2949.3323 2950.2461 2953.1340 2957.6948 2962.1414 2967.0025 2967.7205 2970.6206 2977.7890 2980.2538 2982.9438 2986.9166 2992.5799 3000.4059 3009.5491 3017.9153 3025.6597 3033.8502 3040.9269 3049.5484 3067.3499 3069.6945 3122.9180 3131.9990 3142.3552 3144.3689 3147.3519 3156.8167 3170.8065
redmass: 1.6171 4.2688 4.5812 4.3669 5.0421 1.9040 4.0829 3.4692 2.9740 2.8647 1.9545 4.3804 1.9237 2.2154 4.9688 4.4300 2.0538 2.0434 4.4299 3.7144 4.7449 4.9241 1.1162 4.0722 4.1214 4.5985 5.9595 3.7199 4.4266 4.5463 3.6294 3.3168 7.1577 6.9110 3.2366 7.5726 3.1557 3.1924 3.8475 4.4642 5.2091 7.0899 6.0504 5.5556 5.0426 1.0593 1.0657 1.0783 5.1048 1.1068 4.4365 1.1412 1.4814 1.1901 2.9110 2.2848 1.2354 2.3179 1.2498 1.4264 1.9059 1.2542 1.6772 2.5944 1.3699 1.4078 3.4652 1.7791 2.7449 1.3472 3.9217 1.8048 1.5744 3.6471 3.9717 4.3199 2.5560 2.8189 2.6198 2.1261 2.2180 2.3270 1.4335 1.7646 2.8217 2.1222 1.4484 1.0707 1.8999 1.3023 1.5726 2.3697 1.4338 1.3406 1.5213 1.3440 1.3140 1.3851 1.3437 1.0298 1.3181 1.0781 1.1785 1.0824 1.1550 1.1078 1.5700 1.6836 1.4002 1.4466 1.5396 1.7258 1.6663 1.6270 9.3418 1.2167 8.2162 3.3415 2.4390 2.3639 1.0798 1.0749 1.0938 1.0785 1.1933 1.2904 1.4748 1.1140 1.0871 1.0447 1.0886 1.0921 1.0999 1.0908 10.2071 6.8151 7.6862 6.1874 6.6169 1.0584 1.0584 1.0587 1.0590 1.0591 1.0594 1.0591 1.0586 1.0588 1.0591 1.0363 1.0612 1.0959 1.0967 1.0981 1.1000 1.1019 1.1029 1.1032 1.1042 1.1047 1.1046 1.1044 1.1007 1.0993 1.0875 1.0864 1.0914 1.0897 1.0967 1.0942 1.1006
irintensity: 0.0240 0.1907 0.0445 0.2307 1.5177 0.2195 0.9523 0.5873 0.0423 0.0172 0.0554 0.1730 0.0101 0.0419 0.1690 0.2642 0.0082 0.0395 0.0282 1.4023 0.1407 0.1517 0.0005 1.5067 3.1302 2.8216 3.7504 0.1759 2.8177 1.2241 0.9443 0.6821 0.5579 0.5022 0.2927 9.3032 1.9037 1.9596 6.5646 12.9026 10.5630 13.5026 1.8900 1.7250 0.7133 16.2901 1.7389 7.0638 1.0673 0.0489 1.2292 1.9002 89.8296 0.2270 2.8026 19.7598 1.5832 14.6236 0.4534 0.3738 5.0995 1.0458 5.3753 1.4623 0.3134 4.3853 0.3661 1.4184 0.3249 1.0181 1.1822 6.6524 2.1287 32.2315 9.8046 11.8683 9.3078 0.1989 0.6020 0.0187 0.0492 0.2420 0.1502 0.7441 20.8489 6.1967 19.4000 4.2223 0.7348 26.7372 2.6978 14.8042 0.8133 0.1307 0.3176 1.1615 0.8215 1.2933 4.0017 0.5106 3.4711 0.5419 6.2895 0.6220 6.3655 0.1652 71.0497 57.8032 1.0573 0.4505 0.5902 0.3360 0.1004 0.2518 1.7248 11.2046 15.5286 47.1507 87.7088 29.8635 0.1805 0.0182 1.4660 0.2289 7.0324 14.8885 21.9638 4.3363 0.7142 11.6870 1.3012 0.5232 15.5684 34.4463 164.3817 2.1666 46.8375 49.0722 0.5091 0.0060 0.2042 0.8226 0.5018 1.4789 4.2247 0.3417 103.6989 117.6674 86.8322 39.7747 86.8005 1.2787 1.0360 1.0298 0.6951 0.5790 0.3906 0.9786 3.9708 0.7286 199.8568 135.7580 98.8065 56.3870 11.1635 0.9846 4.2168 8.8435 17.7802 5.5654 33.4370
temp: 298.150 k
press: 1.00000 atm
elementType: 16 8 6 6 6 6 6 6 6 6 6 6 6 6 6 6 6 6 6 6 6 6 6 6 6 6 6 1 1 1 1 1 1 1 1 1 1 1 1 1 1 1 1 1 1 1 1 1 1 1 1 1 1 1 1 1 1 1 1
symmnumber: 1
zpe: 1316036.0 jmol-1
zpe.correction: 0.501252 hartree
zpe.thermalcorrener: 0.527984 hartree
zpe.thermalcorrenthalpy: 0.528928 hartree
zpe.thermalcorrgfe: 0.439604 hartree
zpe.sumelectzpe: -1443.157369 hartree
zpe.sumelectthermal: -1443.130637 hartree
zpe.sumelectthermalent: -1443.129693 hartree
zpe.sumelectthermalfe: -1443.219016 hartree
dipole: 0.0123 -2.0910 -1.3827
dipole: 2.5069
quadrupole: -150.0774 -166.5521 -175.7701
quadrupole: -0.5702 13.7801 -0.2211
quadrupole: 14.0558 -2.4189 -11.6369 -0.5702 13.7801 -0.2211
hfenergy: -1443.6586205 hartree
pointgroup: C01 [X(C25H32O1S1)]
dipole: 0.0165259 0.6330077 0.7561493 debye
polarizability: 438.7210983|58.390743|250.3894978|-30.3697312|40.4262998|230.0281941 unknown
InChI: InChI=1S/C25H32OS/c1-2-3-4-5-6-7-8-9-10-11-14-20-17-18-24-22(19-20)25(26)21-15-12-13-16-23(21)27-24/h12-13,15-19H,2-11,14H2,1H3
charge 0 multiplicity 1
59 atoms
S  -5.947464 1.093487 1.687349
O  -4.408236 -1.476934 -1.768817
C  4.615649 0.600009 -0.628288
C  5.747905 -0.003059 0.233263
C  3.219761 0.481879 0.024505
C  7.141249 0.10172 -0.426777
C  2.095483 1.120428 -0.821749
C  8.278683 -0.472909 0.447435
C  0.696945 0.97918 -0.181677
C  9.670814 -0.3755 -0.216494
C  -0.418691 1.658081 -1.025344
C  10.811685 -0.930522 0.665966
C  -1.79758 1.507227 -0.404737
C  12.203135 -0.837557 -0.0010
C  -2.695167 0.516397 -0.839683
C  -3.977754 0.329543 -0.247387
C  -2.207708 2.349647 0.66968
C  -4.352874 1.186446 0.822446
C  13.338087 -1.384097 0.892103
C  -3.464648 2.195001 1.276163
C  -4.836591 -0.757088 -0.804593
C  -6.197066 -1.006444 -0.239328
C  -6.780269 -0.274426 0.831673
C  -6.961251 -2.058927 -0.824774
C  -8.083342 -0.586238 1.300042
C  -8.249001 -2.372235 -0.367637
C  -8.813137 -1.629287 0.70317
H  4.600178 0.097534 -1.618121
H  4.837852 1.669658 -0.826779
H  5.521353 -1.069446 0.443318
H  5.770209 0.50905 1.218178
H  2.986045 -0.589205 0.198251
H  3.242008 0.961215 1.025655
H  7.3587 1.166278 -0.655725
H  7.12501 -0.428051 -1.402348
H  2.084854 0.655297 -1.8297
H  2.321236 2.196383 -0.978714
H  8.059036 -1.535352 0.683571
H  8.298808 0.062858 1.419744
H  0.450827 -0.093881 -0.052963
H  0.70694 1.421205 0.835606
H  9.65502 -0.923028 -1.182301
H  9.884283 0.68547 -0.465156
H  -0.168383 2.732071 -1.139001
H  -0.412975 1.218025 -2.040924
H  10.598464 -1.990379 0.919361
H  10.831555 -0.379528 1.629791
H  12.412292 0.220569 -0.260476
H  12.184729 -1.394286 -0.960271
H  -2.437891 -0.157842 -1.664463
H  -1.533774 3.138001 1.026527
H  13.399602 -0.821097 1.842716
H  13.16621 -2.447762 1.14417
H  14.32107 -1.31015 0.391268
H  -3.764051 2.855655 2.097432
H  -6.491216 -2.607341 -1.647485
H  -8.517766 -0.012389 2.126112
H  -8.817165 -3.184324 -0.832525
H  -9.818374 -1.863936 1.069644
